Identifier
notation: lu:lu_ontwinprior_klimreg_10m

WCS- Publieke Download Service van Vlaamse Overheid - beleidsdomein Omgeving - samenwerkingsverband MercatorNet
type: DataService
endpoint URL: https://www.mercator.vlaanderen.be/raadpleegdienstenmercatorpubliek/ows
subject: OGCWMS
subject: OGCWCS
description: WCS - Öffentlicher Downloaddienst der Flämischen Regierung - Politikbereich Umwelt - Partnerschaft MercatorNet @de
title: WCS- Öffentlicher Download Service der Flämischen Regierung - Politikbereich Umwelt - Partnerschaft MercatorNet @de
conforms to: Technical Guidance for the implementation of INSPIRE Download Services
title: WCS- Service public de téléchargement du gouvernement flamand - domaine politique Environnement - Partenariat MercatorNet @fr
subject: infoMapAccessService
keyword: WMS
description: WCS - Publieke Download Service van Vlaamse Overheid - beleidsdomein Omgeving - samenwerkingsverband MercatorNet
subject: infoCoverageAccessService
spatial: Flanders
title: WMS - Publieke View Service van Vlaamse Overheid - beleidsdomein Omgeving - samenwerkingsverband MercatorNet
identifier: Identifier
  notation: WCS- Publieke Download Service van Vlaamse Overheid - beleidsdomein Omgeving - samenwerkingsverband MercatorNet
identifier: Identifier
  notation: WCS- Publieke Download Service van Vlaamse Overheid - beleidsdomein Omgeving - samenwerkingsverband MercatorNet
keyword: GDI-MercatorNet
keyword: MercatorNet
keyword: WCS
keyword: Vlaanderen
title: WCS- Public Download Service of the Flemish Government - policy area Environment - MercatorNet partnership @en
description: WCS - Service public de téléchargement du gouvernement flamand - domaine politique Environnement - Partenariat MercatorNet @fr
keyword: View Service
description: WMS - Publieke View Service van Vlaamse Overheid - beleidsdomein Omgeving - samenwerkingsverband MercatorNet
keyword: OpenbareMetadata
landing page: https://www.vlaanderen.be/DataCatalogRecord/6f8c1407-e109-f598-32c7-a068-2298-bdde-122da642
applicable legislation: oj
modified: 2022-03-04
endpoint description: https://www.mercator.vlaanderen.be/raadpleegdienstenmercatorpubliek/ows
access rights: openbaar
conforms to: Technical Guidance for the implementation of INSPIRE Discovery Services
contact point: Kind
  fn: MercatorNet
publisher: Departement Omgeving
landing page: https://www.vlaanderen.be/DataCatalogRecord/1af7f4fc-bb73-469f-9001-019c103b695f
keyword: Download Service
description: WCS - Public Download Service of the Flemish Government - policy area Environment - MercatorNet partnership @en
conforms to: OGC:WMS

Technical Guidance for the implementation of INSPIRE Download Services
type: Standard

http://data.gov.be/.well-known/genid/rights/f011858c7e4c5d141b423b4302e9bfc0783c3a5f
type: RightsStatement
title: Le service peut être utilisé par n'importe qui. Le prestataire du service ne donne aucune garantie quant au fonctionnement du service, ni quant à l'exactitude des informations proposées. En utilisant le service, chaque utilisateur ou consultant s'engage à respecter les dispositions d'accès et d'utilisation des données fournies dans le service. Veuillez vous référer aux dispositions relatives à l'accès et à l'utilisation dans les métadonnées de tous les ensembles de données proposés dans le service. Lors de l'utilisation du service, le fournisseur du service traite les données du consultant. Ces informations concernant l'enregistrement et le stockage des données de l'utilisateur par le fournisseur doivent toujours être communiquées au préalable par le fournisseur au consultant. @fr
title: Der Dienst kann von jedem genutzt werden. Der Anbieter des Dienstes gibt keine Garantien in Bezug auf den Betrieb des Dienstes, noch in Bezug auf die Richtigkeit der angebotenen Informationen. Durch die Nutzung des Dienstes verpflichtet sich jeder Nutzer oder Berater, die Zugangs- und Nutzungsbestimmungen der im Dienst bereitgestellten Daten einzuhalten. Bitte beachten Sie die Zugriffs- und Nutzungsbestimmungen in den Metadaten aller im Service angebotenen Datensätze. Bei der Nutzung des Dienstes verarbeitet der Anbieter des Dienstes die Daten des Beraters. Diese Informationen über die Protokollierung und Speicherung der Daten des Nutzers durch den Anbieter muss der Anbieter dem Berater immer im Voraus mitteilen. @de
title: The service can be used by anyone. The provider of the service gives no guarantees with regard to the operation of the service, nor with regard to the accuracy of the information offered. By using the service, each user or consultant undertakes to comply with the access and use provisions of the data provided in the service. Please refer to the access and usage provisions in the metadata of all datasets offered in the service. When using the service, the provider of the service processes the data of the consultant. This information regarding the logging and storage of the user's data by the provider must always be communicated by the provider to the consultant in advance. @en
title: De service kan door iedereen gebruikt worden. De aanbieder van de service geeft geen garanties t.a.v. de werking van de service, noch t.a.v. de juistheid van de aangeboden informatie. Door het gebruik van de service verbindt elke gebruiker of raadpleger er zich toe om zich te houden aan de toegangs- en gebruiksbepalingen van de in de service aangeboden gegevens. Gelieve de toegangs- en gebruiksbepalingen te raadplegen in de metadata van alle datasets die in de service worden aangeboden. Bij het gebruik van de service verwerkt de aanbieder van de service het de gegevens van de raadpleger. Deze informatie met betrekking tot de loggen en bewaren van gegevens van de gebruiker door de aanbieder moet altijd voorafgaandelijk door de aanbieder gecommuniceerd worden aan de raadpleger.

Flanders
type: Location

http://data.gov.be/.well-known/genid/rights/62ba9ee54f327dfc5f0deec1dcbcdafc626ea50f
type: RightsStatement
title: De service kan door iedereen gebruikt worden. De aanbieder van de service geeft geen garanties t.a.v. de werking van de service, noch t.a.v. de juistheid van de aangeboden informatie. Door het gebruik van de service verbindt elke gebruiker of raadpleger er zich toe om zich te houden aan de toegangs- en gebruiksbepalingen van de in de service aangeboden gegevens. Gelieve de toegangs- en gebruiksbepalingen te raadplegen in de metadata van alle datasets die in de service worden aangeboden. Bij het gebruik van de service verwerkt de aanbieder van de service het de gegevens van de raadpleger. Deze informatie met betrekking tot de loggen en bewaren van gegevens van de gebruiker door de aanbieder moet altijd voorafgaandelijk door de aanbieder gecommuniceerd worden aan de raadpleger.
title: Le service peut être utilisé par n'importe qui. Le prestataire du service ne donne aucune garantie quant au fonctionnement du service, ni quant à l'exactitude des informations proposées. En utilisant le service, chaque utilisateur ou consultant s'engage à respecter les dispositions d'accès et d'utilisation des données fournies dans le service. Veuillez vous référer aux dispositions relatives à l'accès et à l'utilisation dans les métadonnées de tous les ensembles de données proposés dans le service. Lors de l'utilisation du service, le fournisseur du service traite les données du consultant. Ces informations concernant l'enregistrement et le stockage des données de l'utilisateur par le fournisseur doivent toujours être communiquées au préalable par le fournisseur au consultant. @fr
title: Der Dienst kann von jedem genutzt werden. Der Anbieter des Dienstes gibt keine Garantien in Bezug auf den Betrieb des Dienstes, noch in Bezug auf die Richtigkeit der angebotenen Informationen. Durch die Nutzung des Dienstes verpflichtet sich jeder Nutzer oder Berater, die Zugangs- und Nutzungsbestimmungen der im Dienst bereitgestellten Daten einzuhalten. Bitte beachten Sie die Zugriffs- und Nutzungsbestimmungen in den Metadaten aller im Service angebotenen Datensätze. Bei der Nutzung des Dienstes verarbeitet der Anbieter des Dienstes die Daten des Beraters. Diese Informationen über die Protokollierung und Speicherung der Daten des Nutzers durch den Anbieter muss der Anbieter dem Berater immer im Voraus mitteilen. @de
title: The service can be used by anyone. The provider of the service gives no guarantees with regard to the operation of the service, nor with regard to the accuracy of the information offered. By using the service, each user or consultant undertakes to comply with the access and use provisions of the data provided in the service. Please refer to the access and usage provisions in the metadata of all datasets offered in the service. When using the service, the provider of the service processes the data of the consultant. This information regarding the logging and storage of the user's data by the provider must always be communicated by the provider to the consultant in advance. @en

Geïntegreerde prioriteitenkaart voor onthardingswinst klimaatregulatie
type: Dataset
keyword: OpenbareMetadata
conforms to: ISO TC 211 GMD
rights holder: Departement Omgeving
keyword: MercatorNet
keyword: onthardingswinst
title: Integrierte Prioritätenkarte zur Abmilderung der Fortschritte bei der Klimaregulierung @de
title: Integrated priority map for softening gains in climate regulation @en
conforms to: Belgian Lambert 72
subject: regional
spatial: Flanders
theme: Regio's en steden
keyword: lu_ontwinprior_klimreg_10m
publisher: Departement Omgeving
theme: Milieu
has quality measurement: QualityMeasurement
  is measurement of: spatialResolutionAsDistance
  unit measure: http://qudt.org/vocab/unit/M
  value: 10
keyword: Geïntegreerde prioriteitenkaart voor onthardingswinst klimaatregulatie
landing page: https://www.vlaanderen.be/DataCatalogRecord/04777752-67ea-5e4e-922e-ca61281565ca
title: Carte intégrée des priorités pour atténuer les gains en matière de régulation du climat @fr
subject: Vlaams Gewest
keyword: klimaatregulatie
accrual periodicity: onbekend
access rights: openbaar
representation technique: grid
description: Carte intégrée des priorités pour la «réglementation climatique» visant à atténuer les bénéfices, telle que décrite dans le rapport. La grille donne un score qui est le résultat de la somme des scores des cartes de critères sous-jacentes, c'est-à-dire l'effet d'îlot de chaleur urbain et le stockage de carbone. Cette somme a de nouveau été réduite à un score de 1 à 5. Les zones avec un score maximum de 5 montrent les gains d'adoucissement les plus élevés dans le thème du règlement sur le climat. Les zones urbanisées sont clairement visibles. Voici des priorités claires pour l'assouplissement en vue de la régulation du climat. Le durcissement des sols a un impact majeur sur le climat, à la fois à l'échelle locale et mondiale. En recuit, les sols peuvent à nouveau fonctionner comme des puits de carbone. Cette carte intégrée sur la régulation du climat contribue à l’élaboration de la carte finale des possibilités d’atténuation des gains (https://www.vlaanderen.be/data source/catalogue/opportunity map-softening gains ). Afin de réduire efficacement le degré de durcissement, il est important de mieux comprendre les endroits les plus susceptibles d'adoucir le sol. Afin de déterminer où le recuit est le plus prometteur, la carte d'opportunité des gains de recuit (et le cadre d'évaluation) a donc été développée. Les cartes de priorité intégrées sur l'adoucissement - y compris cette carte pour la régulation du climat - montrent par paramètre si un emplacement pavé a un impact important ou faible sur l'environnement et a donc une priorité grande ou petite pour l'adoucissement. Plus d'informations sur la création de toutes les cartes de priorité et d'opportunité et la combinaison finale avec la carte d'opportunité finale adoucissant le bénéfice peuvent être trouvées dans le rapport final de l'étude réalisée pour le compte du ministère de l'Environnement: https://researchportal.be/fr/publication/softening profit-weighting framework-and-opportunity map-part-1 (en anglais) @fr
identifier: Identifier
  notation: https://metadata.omgeving.vlaanderen.be/srv/resources/datasets/2bde0efc-154d-50c3-9f68-428e268745ec
description: Integrated priority map for the softening profit ‘climate regulation’ as described in the report. The grid map gives a score that is the result of the sum of the scores of the underlying criteria maps, i.e. urban heat island effect and carbon storage. This sum was again reduced to a score of 1 to 5. The areas with a maximum score of 5 show the highest softening gains within the Climate Regulation theme. The urbanised areas are clearly visible. Here are clear priorities for softening with a view to climate regulation. Soil hardening has a major impact on the climate, both on a local and global scale. By annealing, soils can once again function as carbon sinks. This integrated map on climate regulation contributes to the preparation of the final opportunity map for softening gains (https://www.vlaanderen.be/data source/catalogue/opportunity map-softening gains ). In order to efficiently and effectively reduce the degree of hardening, it is important to gain insight into those locations that are most likely to soften the soil. In order to determine where annealing is most promising, the opportunity map of annealing gains (and assessment framework) was thus developed. The integrated priority maps on softening - including this map for climate regulation - show per parameter whether a paved location has a large or small impact on the environment and therefore has a large or small priority for softening. More information about the creation of all priority and opportunity cards and the final combination to the final opportunity card softening profit can be found in the final report of the study carried out on behalf of the Environment department: https://researchportal.be/en/publication/softening profit-weighting framework-and-opportunity map-part-1 @en
description: Integrierte Prioritätskarte für die „Klimaregulierung“, wie im Bericht beschrieben. Die Rasterkarte gibt eine Punktzahl an, die sich aus der Summe der Punktzahlen der zugrunde liegenden Kriterienkarten ergibt, d. h. dem städtischen Wärmeinseleffekt und der Kohlenstoffspeicherung. Diese Summe wurde erneut auf eine Punktzahl von 1 bis 5 reduziert. Die Gebiete mit einer Höchstpunktzahl von 5 weisen die höchsten Abschwächungsgewinne innerhalb des Themas Klimaregulierung auf. Die urbanisierten Gebiete sind deutlich sichtbar. Hier sind klare Prioritäten für die Abschwächung mit Blick auf die Klimaregulierung. Die Aushärtung des Bodens hat große Auswirkungen auf das Klima, sowohl auf lokaler als auch auf globaler Ebene. Durch das Glühen können Böden wieder als Kohlenstoffsenken fungieren. Diese integrierte Karte zur Klimaregulierung trägt zur Erstellung der endgültigen Karte der Möglichkeiten zur Abschwächung der Gewinne bei (https://www.vlaanderen.be/data source/catalogue/opportunity map-softening gains ). Um den Grad der Aushärtung effizient und effektiv zu reduzieren, ist es wichtig, Einblick in die Orte zu erhalten, die den Boden am ehesten erweichen. Um zu bestimmen, wo das Glühen am vielversprechendsten ist, wurde die Opportunitätskarte der Glühgewinne (und des Bewertungsrahmens) entwickelt. Die integrierten Prioritätenkarten zur Erweichung - einschließlich dieser Karte zur Klimaregulierung - zeigen pro Parameter, ob ein gepflasterter Standort große oder kleine Auswirkungen auf die Umwelt hat und daher eine große oder kleine Priorität für die Erweichung hat. Weitere Informationen über die Erstellung aller Prioritäts- und Opportunitätskarten und die endgültige Kombination mit der endgültigen Opportunitätskarte, die den Gewinn erweicht, finden Sie im Abschlussbericht der Studie, die im Auftrag des Umweltministeriums durchgeführt wurde: https://researchportal.be/de/publication/softening profit-weighting framework-and-opportunity map-part-1 (Deutsche Übersetzung) @de
description: Geïntegreerde prioriteitenkaart voor de onthardingswinst “klimaatregulatie” zoals beschreven in het rapport. De rasterkaart geeft een score die het resultaat is van de optelsom van de scores van de onderliggende criteriakaarten, nl. stedelijk hitte-eilandeffect en koolstofopslag. Deze optelsom werd opnieuw herleid naar een score van 1 tot 5. De gebieden met maximale score 5 vertonen de hoogste onthardingswinsten binnen het thema Klimaatregulatie. De verstedelijkte gebieden springen duidelijk in het oog. Hier liggen duidelijke prioriteiten voor ontharding met het oog op klimaatregulatie. Het verharden van de bodem heeft een grote impact op het klimaat, zowel op lokale als op globale schaal. Door te ontharden kunnen bodems opnieuw fungeren als carbon sink. Deze geïntegreerde kaart rond klimaatregulatie draagt bij aan de opmaak van de finale kansenkaart voor onthardingswinst (https://www.vlaanderen.be/datavindplaats/catalogus/kansenkaart-onthardingswinst ). Om efficiënt en effectief de verhardingsgraad terug te dringen, is het belangrijk zicht te krijgen op die locaties die het meest kansrijk zijn voor een ontharding van de bodem. Om te bepalen waar ontharding het meest kansrijk is, werd aldus de kansenkaart onthardingswinst (en afwegingskader) ontwikkeld. De geïntegreerde prioriteitenkaarten rond ontharding – waaronder dus deze kaart voor klimaatregulatie - tonen per parameter of een verharde locatie een grote of kleine impact heeft op de omgeving en dus een grote of kleine prioriteit voor ontharding heeft. Meer info over de totstandkoming van alle prioriteiten- en opportuniteitenkaarten en de uiteindelijke combinatie tot de finale kansenkaart onthardingswinst vind je in het eindrapport van de studie uitgevoerd in opdracht van het departement Omgeving: https://researchportal.be/nl/publicatie/onthardingswinst-afwegingskader-en-kansenkaart-deel-1
keyword: koostofopslag
created: 2023-04-27
contact point: Kind
  has URL: https://www.omgevingvlaanderen.be
  fn: Vlaamse overheid, Departement Omgeving, Vlaams Planbureau voor Omgeving (VPO)
  has URL: https://omgeving.vlaanderen.be/nl/contact
  fn: Vlaamse overheid, Departement Omgeving, Afdeling Beleid, Team Bodem
  fn: Vlaams Planbureau voor Omgeving
keyword: stedelijk hitte-eilandeffect
spatial resolution in meters: 10
language: Nederlands

ISO TC 211 GMD
type: Standard

Departement Omgeving
type: Organization
type: Regionaal bestuur
type: Agent

Regionaal bestuur
type: Concept
preferred label: Regional Authority @en
in scheme: http://purl.org/adms/publishertype/1.0

Belgian Lambert 72
type: Standard
title: Belge 1972 / Belgian Lambert 72
type: SpatialReferenceSystem
title: EPSG:31370

Regio's en steden
type: Concept
preferred label: REGIONS, CITIES @en
in scheme: data-theme
preferred label: Regional @en
preferred label: Régions et villes @fr

Milieu
type: Concept
preferred label: Environment @en
preferred label: Environnement @fr
in scheme: data-theme
preferred label: Umwelt @de
preferred label: ENVIRONMENT @en

lu:lu_ontwinprior_klimreg_10m
type: Distribution
access URL: https://metadata.vlaanderen.be/srv/dut/catalog.search#/metadata/04777752-67ea-5e4e-922e-ca61281565ca
license: Vlaamse Open Data licentie gratis hergebruik
description: WCS-getCoverage Hartă prioritară integrată pentru reglarea climei (AccessURL se referă la un set limitat de date, conform acordurilor INSPIRE) @ro
description: WCS-getCoverage Mappa ta’ prijorità integrata għat-tnaqqis tar-regolamentazzjoni tal-klima (L-aċċessURL jirreferi għal sett limitat ta’ data, skont il-ftehimiet INSPIRE) @mt
description: WCS-getCoverage Integrirana prednostna karta za omilitev podnebne ureditve dobička (AccessURL se nanaša na omejen nabor podatkov v skladu s sporazumi INSPIRE) @sl
description: WCS-getCoverage Integrierte Prioritätskarte zur Lockerung der Klimaregulierung (Die accessURL bezieht sich auf einen begrenzten Datensatz gemäß den INSPIRE-Vereinbarungen) @de
conforms to: OGC:WCS-2.0.0-http-get-coverage
description: WCS-getCoverage Integreret prioritetskort til blødgøring af gain climate-regulering (accessURL henviser til et begrænset datasæt i henhold til Inspire-aftalerne) @da
description: WCS-getCoverage Integruotas prioritetų žemėlapis klimato reguliavimui švelninti (prieigaURL reiškia ribotą duomenų rinkinį pagal INSPIRE susitarimus) @lt
description: WCS-getCoverage Integrated priority map for softening gain climate regulation (Το accessURL αναφέρεται σε ένα περιορισμένο σύνολο δεδομένων, σύμφωνα με τις συμφωνίες INSPIRE) @el
description: WCS-getCoverage Geïntegreerde prioriteitenkaart voor onthardingswinst klimaatregulatie (De accessURL verwijst naar een gelimiteerde set van data, volgens de INSPIRE afspraken)
description: WCS-getCoverage Integrovaná prioritná mapa na zmäkčenie regulácie klímy (AccessURL sa vzťahuje na obmedzený súbor údajov podľa dohôd INSPIRE) @sk
description: WCS-getCoverage Mappa delle priorità integrata per ammorbidire la regolazione del clima di guadagno (L'accessURL si riferisce a un insieme limitato di dati, secondo gli accordi INSPIRE) @it
description: WCS-getCoverage Integrated priority map for softening gain climate regulation (The accessURL refers to a limited set of data, according to the INSPIRE agreements) @en
description: WCS-getCoverage Integrovaná prioritní mapa pro změkčení regulace klimatu (AccessURL odkazuje na omezený soubor dat podle dohod INSPIRE) @cs
description: WCS-getCoverage Інтегрована карта пріоритетів для регулювання клімату пом'якшення посилення (AccessURL відноситься до обмеженого набору даних, відповідно до угод INSPIRE) @uk
description: WCS-getCoverage Integrirana karta prioriteta za ublažavanje klimatskih promjena (Pristup URL-u odnosi se na ograničeni skup podataka, u skladu sa sporazumima INSPIRE) @hr
media type: application/xml
description: WCS-getCoverage Zintegrowana mapa priorytetów dla złagodzenia regulacji klimatu (dostęp URL odnosi się do ograniczonego zestawu danych, zgodnie z umowami INSPIRE) @pl
description: WCS-getCoverage Integrerad prioriteringskarta för att mildra förstärkningsklimatreglering (accessURL hänvisar till en begränsad uppsättning data, enligt Inspire-avtalen) @sv
description: WCS-getCoverage Интегрирана приоритетна карта за смекчаване на изменението на климата (ДостъпътURL се отнася до ограничен набор от данни съгласно споразуменията INSPIRE) @bg
description: WCS-getCoverage Integrated priority map for softening gain climate regulation (KäyttöoikeusURL viittaa rajoitettuun tietojoukkoon INSPIRE-sopimusten mukaan) @fi
download URL: https://www.mercator.vlaanderen.be/raadpleegdienstenmercatorpubliek/ows
description: WCS-getCoverage Carte intégrée des priorités pour assouplir la régulation climatique du gain (L'accessURL fait référence à un ensemble limité de données, selon les accords INSPIRE) @fr
description: WCS-getCoverage Integreeritud prioriteetide kaart kliimamuutuste leevendamise reguleerimiseks (juurdepääsURL viitab INSPIRE kokkulepete kohaselt piiratud andmekogumile) @et
format: WCS
description: WCS-getCoverage Integrált prioritási térkép az éghajlatváltozás enyhítésére (az AccessURL korlátozott adathalmazra utal az INSPIRE megállapodások szerint) @hu
description: WCS-getCoverage Mapa prioritário integrado para suavizar a regulação climática do ganho (O accessURL refere-se a um conjunto limitado de dados, de acordo com os acordos INSPIRE) @pt
description: WCS-getCoverage Mapa de prioridades integrado para suavizar la regulación climática de ganancia (El accessURL se refiere a un conjunto limitado de datos, de acuerdo con los acuerdos INSPIRE) @es
description: Léarscáil tosaíochta chomhtháite WCS-getCoverage chun rialáil aeráide a dhéanamh níos boige (Tagraíonn an accessURL do thacar teoranta sonraí, de réir chomhaontuithe INSPIRE) @ga
availability: AVAILABLE
description: WCS-getCoverage Integrētā prioritāšu karte ieguvumu klimata regulējuma mīkstināšanai (AccessURL attiecas uz ierobežotu datu kopumu saskaņā ar INSPIRE nolīgumiem) @lv
identifier: Identifier
  notation: lu:lu_ontwinprior_klimreg_10m
character encoding: UTF-8

Vlaamse Open Data licentie gratis hergebruik
type: LicenseDocument
type: Naamsvermelding

Naamsvermelding
type: Concept
preferred label: Attribution
in scheme: http://purl.org/adms/licencetype/1.0
notation: Attribution
type: LicenseDocument
preferred label: Verplichte bronvermelding

application/xml
type: Concept
in scheme: media-types
type: MediaType

WCS
type: MediaTypeOrExtent
type: Concept
in scheme: file-type

onbekend
type: Frequency
preferred label: unbekannt @de
preferred label: inconnu @fr
in scheme: frequency
preferred label: unknown @en
type: Concept

openbaar
type: Concept
preferred label: public @fr
preferred label: without conditions @fr
in scheme: access-right
preferred label: Toegang zonder voorwaarden
type: RightsStatement
preferred label: öffentlich @de
preferred label: publiek
preferred label: publicly available @en
preferred label: Public @en

lu:lu_ontwinprior_klimreg_10m
type: Distribution
description: Léarscáil tosaíochta chomhtháite chun rialáil aeráide a dhéanamh níos boige (Tagraíonn an AccessURL do thacar teoranta sonraí, de réir chomhaontuithe INSPIRE) @ga
description: Mappa delle priorità integrata per ammorbidire la regolazione del clima di guadagno (L'accessURL si riferisce a un insieme limitato di dati, secondo gli accordi INSPIRE) @it
license: Vlaamse Open Data licentie gratis hergebruik
download URL: https://www.mercator.vlaanderen.be/raadpleegdienstenmercatorpubliek/ows
description: WMS getmap Інтегрована карта пріоритетів для пом'якшення регулювання посилення клімату (AccessURL відноситься до обмеженого набору даних, відповідно до угод INSPIRE) @uk
description: WMS getmap Integrierte Prioritätskarte zur Aufweichung der Gewinnklimaregulierung (Die accessURL bezieht sich auf einen begrenzten Datensatz gemäß den INSPIRE-Vereinbarungen) @de
description: WMS getmap Интегрирана приоритетна карта за смекчаване на изменението на климата (ДостъпътURL се отнася до ограничен набор от данни съгласно споразуменията INSPIRE) @bg
description: WMS getmap Mappa ta’ prijorità integrata għat-tnaqqis tar-regolamentazzjoni tal-klima (L-aċċessURL jirreferi għal sett limitat ta’ data, skont il-ftehimiet ta’ INSPIRE) @mt
description: WMS getmap Integrated priority map for softening gain climate regulation (Ο accessURL αναφέρεται σε ένα περιορισμένο σύνολο δεδομένων, σύμφωνα με τις συμφωνίες INSPIRE) @el
character encoding: UTF-8
description: WMS getmap Integrovaná prioritná mapa na zmiernenie regulácie klímy (AccessURL sa vzťahuje na obmedzený súbor údajov podľa dohôd INSPIRE) @sk
availability: AVAILABLE
identifier: Identifier
  notation: lu:lu_ontwinprior_klimreg_10m
description: Mapa de prioridades integrado para suavizar la regulación climática de ganancia (El accessURL se refiere a un conjunto limitado de datos, de acuerdo con los acuerdos INSPIRE) @es
description: WMS getmap Integrovaná prioritní mapa pro změkčení regulace klimatu (AccessURL odkazuje na omezený soubor dat podle dohod INSPIRE) @cs
description: WMS getmap Integrerad prioriteringskarta för att mildra förstärkningsklimatreglering (accessURL hänvisar till en begränsad uppsättning data, enligt Inspire-avtalen) @sv
description: Carte de priorité intégrée pour assouplir la régulation climatique du gain (L'accessURL fait référence à un ensemble limité de données, selon les accords INSPIRE) @fr
description: Integrēta prioritāšu karte ieguvumu klimata regulējuma mīkstināšanai (AccessURL attiecas uz ierobežotu datu kopumu saskaņā ar INSPIRE nolīgumiem) @lv
format: WMS
description: WMS getmap Zintegrowana mapa priorytetów dla złagodzenia regulacji klimatu (dostępURL odnosi się do ograniczonego zestawu danych, zgodnie z umowami INSPIRE) @pl
description: WMS getmap Integruotas prioritetų žemėlapis klimato reguliavimui švelninti (prieigaURL reiškia ribotą duomenų rinkinį pagal INSPIRE susitarimus) @lt
description: WMS getmap Integreeritud prioriteetide kaart kliimamuutuste leevendamise reguleerimiseks (juurdepääsURL viitab piiratud hulgale andmetele vastavalt INSPIRE kokkulepetele) @et
description: WMS getmap Integrirana prednostna karta za mehčanje podnebne ureditve dobička (AccessURL se nanaša na omejen nabor podatkov, v skladu s sporazumi INSPIRE) @sl
media type: application/xml
description: WMS getmap Integroitu prioriteettikartta ilmaston säätelyn pehmentämiseksi ( AccessURL viittaa rajoitettuun tietojoukkoon INSPIRE-sopimusten mukaan) @fi
description: WMS-getmap Geïntegreerde prioriteitenkaart voor onthardingswinst klimaatregulatie (De accessURL verwijst naar een gelimiteerde set van data, volgens de INSPIRE afspraken)
conforms to: OGC:WMS-1.3.0-http-get-map
description: Mapa integrado de prioridades para suavizar a regulação climática do ganho (O accessURL refere-se a um conjunto limitado de dados, de acordo com os acordos INSPIRE) @pt
description: WMS getmap Integreret prioriteret kort for at blødgøre gain klimaregulering (AccessURL henviser til et begrænset sæt data, i henhold til Inspire-aftalerne) @da
description: WMS getmap Integrated priority map for softening gain climate regulation (The accessURL refers to a limited set of data, according to the INSPIRE agreements) @en
access URL: https://metadata.vlaanderen.be/srv/dut/catalog.search#/metadata/04777752-67ea-5e4e-922e-ca61281565ca
description: Integrirana karta prioriteta za ublažavanje klimatskih promjena (Pristup URL-u odnosi se na ograničeni skup podataka, u skladu sa sporazumima INSPIRE) @hr
description: Harta integrată a priorităților pentru reglarea climei (AccessURL se referă la un set limitat de date, conform acordurilor INSPIRE) @ro
description: WMS getmap Integrált prioritási térkép az éghajlatváltozás enyhítésére (az AccessURL korlátozott adathalmazra utal, az INSPIRE megállapodások szerint) @hu

WMS
type: MediaTypeOrExtent
in scheme: file-type
type: Concept

lu:lu_ontwinprior_klimreg_10m
type: Distribution
description: Töltse le a zip csomagot. @hu
description: Stáhnout balíček zip. @cs
description: Lae zip pakett. @et
description: Descărcați pachetul zip. @ro
conforms to: WWW:DOWNLOAD-1.0-http--download
download URL: https://datasets.omgeving.vlaanderen.be/be.vlaanderen.omgeving.distribution.geo.2bde0efc-154d-50c3-9f68-428e268745ec.lu_ontwinprior_klimreg_10m.zip
rights: https://codex.vlaanderen.be/PrintDocument.ashx
description: Scarica il pacchetto zip. @it
format: GeoTIFF
description: Descargue el paquete zip. @es
description: Download zip package. @en
description: Lataa zip-paketti. @fi
description: Prenesite paket zip. @sl
description: Hämta zip-paket. @sv
availability: AVAILABLE
description: Lejupielādēt zip pakotni. @lv
description: Изтеглете ZIP пакет. @bg
character encoding: UTF-8
description: Stiahnuť zip balíček. @sk
description: Parsisiųsti zip paketą. @lt
description: Pobierz pakiet zip. @pl
description: Íoslódáil an pacáiste zip. @ga
description: Завантажити zip пакет. @uk
license: Vlaamse Open Data licentie gratis hergebruik
description: Télécharger le paquet zip. @fr
description: Niżżel il-pakkett zip. @mt
description: Download zip-pakke. @da
description: Download zip-pakket.
description: Κατεβάστε το πακέτο zip. @el
description: Baixe o pacote zip. @pt
description: ZIP-Paket herunterladen. @de
description: Preuzmite zip paket. @hr
access URL: https://metadata.vlaanderen.be/srv/dut/catalog.search#/metadata/04777752-67ea-5e4e-922e-ca61281565ca

https://codex.vlaanderen.be/PrintDocument.ashx
type: RightsStatement
title: Toegang en gebruik voor het uitvoeren van taken van algemeen belang, op niveau van Vlaamse overheidsinstanties is geregeld door het Besluit van de Vlaamse Regering met de regels voor toegang en gebruik van geografische gegevensbronnen toegevoegd aan de GDI, door deelnemers GDI-Vlaanderen. Dit gebruik is kosteloos.
title: Accès et utilisation pour l'exécution de tâches d'intérêt général, au niveau flamand les autorités publiques sont régies par le décret du gouvernement flamand avec les règles pour l'accès et l'utilisation des sources de données géographiques ajoutées à l'IDG, par participants GDI-Flandre. Cette utilisation est gratuite. @fr
title: Toegang en gebruik voor het uitvoeren van taken van algemeen belang, op niveau van Vlaamseoverheidsinstanties is geregeld door het Besluit van de Vlaamse Regering met de regels voor toegang en gebruik van geografische gegevensbronnen toegevoegd aan de GDI, door deelnemers GDI-Vlaanderen. Dit gebruik is kosteloos.
title: Zugang und Verwendung zur Erfüllung von Aufgaben von allgemeinem Interesse auf flämischer Ebene Behörden werden durch das Dekret der flämischen Regierung mit den Regeln geregelt für Zugang zu und Nutzung geografischer Datenquellen, die der GDI hinzugefügt wurden, durch Teilnehmer GDI-Flandern. Diese Nutzung ist kostenlos. @de
title: Access and use for the performance of tasks of general interest, at Flemish level public authorities is regulated by the Decree of the Flemish Government with the rules for access and use of geographical data sources added to the GDI, by participants GDI-Flanders. This use is free of charge. @en

https://codex.vlaanderen.be/PrintDocument.ashx
type: RightsStatement
title: Der Zugang und die Nutzung für die Wahrnehmung von Aufgaben von allgemeinem Interesse durch nichtflämische Behörden wird durch das Dekret der flämischen Regierung mit den Regeln für den Zugang und die Nutzung geografischer Datenquellen geregelt, die dem GDI von Behörden hinzugefügt werden, die nicht an GDI-Flandern teilnehmen. Diese Nutzung ist kostenlos. @de
title: L’accès et l’utilisation pour l’exécution de tâches d’intérêt général par des autorités publiques non flamandes sont régis par le décret du gouvernement flamand, les règles d’accès et d’utilisation des sources de données géographiques étant ajoutées au GDI, par des autorités publiques qui ne participent pas au GDI-Flandre. Cette utilisation est gratuite. @fr
title: Toegang en gebruik voor het uitvoeren van taken van algemeen belang door niet-Vlaamse overheidsinstanties is geregeld door het Besluit van de Vlaamse Regering met de regels voor toegang en gebruik van geografische gegevensbronnen toegevoegd aan de GDI, door overheidsdiensten die geen deelnemer zijn aan GDI-Vlaanderen. Dit gebruik is kosteloos.
title: Access and use for the performance of tasks of general interest by non-Flemish public authorities is regulated by the Decree of the Flemish Government with the rules for access and use of geographical data sources added to the GDI, by public authorities that are not participants in GDI-Flanders. This use is free of charge. @en

GeoTIFF
type: MediaTypeOrExtent
in scheme: file-type
type: Concept

autres contraintes
type: RightsStatement
title: Sonstige Zwänge @de
title: other constraints

Zie studie Onthardingswinst: afwegingskader en kansenkaart: https://researchportal.be/nl/publicatie/onthardingswinst-afwegingskader-en-kansenkaart-deel-1
type: ProvenanceStatement

Nederlands
type: LinguisticSystem
preferred label: Dutch @en
preferred label: Niederländisch @de
in scheme: language
preferred label: Néerlandais @fr
preferred label: néerlandais @fr
type: Concept

Technical Guidance for the implementation of INSPIRE Discovery Services
type: Standard
title: Technical Guidance for the implementation of INSPIRE View Services @en

Identifier
notation: lu:lu_ontwinprior_klimreg_10m