Precipitation extremes
type: Dataset
title: Précipitations extrêmes @fr
title: Extrém csapadék @hu
description: In den letzten Jahrzehnten haben die atmosphärischen Konzentrationen von Treibhausgasen und Aerosolen vor allem infolge menschlicher Aktivitäten zugenommen. Dieser Anstieg führt zu erhöhten Temperaturen auf der Erde, fue zu Klimastörungen führt. Dieser Indikator bewertet das Ausmaß, in dem sich das Auftreten extremer Niederschläge in Belgien ändert. Immerhin können Perioden extremer Niederschläge zu Überschwemmungen führen, während lange Trockenperioden zur Austrocknung von Ökosystemen und zur Verschlechterung der Wasserressourcen führen. @es
publisher: Flanders Environment Agency
description: In den letzten Jahrzehnten haben die atmosphärischen Konzentrationen von Treibhausgasen und Aerosolen vor allem infolge menschlicher Aktivitäten zugenommen. Dieser Anstieg führt zu erhöhten Temperaturen auf der Erde, bol zu Klimastörungen führt. Dieser Indikator bewertet das Ausmaß, in dem sich das Auftreten extremer Niederschläge in Belgien ändert. Immerhin können Perioden extremer Niederschläge zu Überschwemmungen führen, während lange Trockenperioden zur Austrocknung von Ökosystemen und zur Verschlechterung der Wasserressourcen führen. @sk
title: Extrem nederbörd @sv
description: I den letzten Jahrzehnten haben die atmosphärischen Konzentrationen von Treibhausgasen und Aerosolen vor allem infolge menschlicher Aktivitäten zugenommen. Dieser Anstieg führt zu erhöhten Temperaturen auf der Erde, var zu Klimastörungen führt. Dieser Indikator bewertet das Ausmaß, in dem sich das Auftreten extremer Niederschläge in Belgien ändert. Immerhin können Perioden extremer Niederschläge zu Überschwemmungen führen, während lange Trockenperioden zur Austrocknung von Ökosystemen und zur Verschlechterung der Wasserressourcen führen. @sv
title: Preċipitazzjoni estrema @mt
description: In den letzten Jahrzehnten haben die atmosphärischen Konzentrationen von Treibhausgasen und Aerosolen vor allem infolge menschlicher Aktivitäten zugenommen. A Dieser Anstieg führt zu erhöhten Temperaturen auf der Erde, volt zu Klimastörungen führt. Dieser Indikator bewertet das Ausmaß, in dem sich das Auftreten extremer Niederschläge in Belgien ändert, Németország Immerhin können Perioden extremer Niederschläge zu Überschwemmungen führen, während lange Trockenperioden zur Austrocknung von Ökosystemen und zur Verschlechterung der Wasserressourcen führen. @hu
description: Στο den letzten Jahrzehnten haben die atmosphärischen Konzentrationen von Treibhausgasen und Aerosolen vor allem infolge menschlicher Aktivitäten zugenommen. Dieser Anstieg führt zu erhöhten Temperaturen auf der Erde, ήταν zu Klimastörungen führt. Dieser Indikator bewertet das Ausmaß, in dem sich das Auftreten extremer Niederschläge in Belgien ändert. Immerhin können Perioden extremer Niederschläge zu Überschwemmungen führen, während lange Trockenperioden zur Austrocknung von Ökosystemen und zur Verschlechterung der Wasserressourcen führen. @el
description: In den letzten Jahrzehnten haben die atmosphärischen Konzentrationen von Treibhausgasen und Aerosolen vor allem infolge menschlicher Aktivitäten zugenommen. Dieser Anstieg führt zu erhöhten Temperaturen auf der Erde, bija zu Klimastörungen führt. Dieser Indikator bewertet das Ausmaß, in dem sich das Auftreten extremer Niederschläge in Belgien ändert. Immerhin können Perioden extremer Niederschläge zu Überschwemmungen führen, während lange Trockenperioden zur Austrocknung von Ökosystemen und zur Verschlechterung der Wasserressourcen führen. @lv
title: Frasaíocht fhoircneach @ga
description: În den letzten Jahrzehnten haben die atmosphärischen Konzentrationen von Treibhausgasen und Aerosolen vor allem infolge menschlicher Aktivitäten zugenommen. Dieser Anstieg führt zu erhöhten Temperaturen auf der Erde, a fost zu Klimastörungen führt. Dieser Indikator bewertet das Ausmaß, in dem sich das Auftreten extremer Niederschläge în Belgien ändert. Immerhin können Perioden extremer Niederschläge zu Überschwemmungen führen, während lange Trockenperioden zur Austrocknung von Ökosystemen und zur Verschlechterung der Wasserressourcen führen. @ro
modified: 2024-12-09
description: Fid-den letzten Jahrzehnten haben die atmosphärischen Konzentrationen von Treibhausgasen und Aerosolen vor allem infolge menschlicher Aktivitäten zugenommen. Dieser Anstieg führt zu erhöhten Temperaturen auf der Erde, kien zu Klimastörungen führt. Dieser Indikator bewertet das Ausmaß, in dem sich das Auftreten extremer Niederschläge in Belgien ändert. Immerhin können Perioden extremer Niederschläge zu Überschwemmungen führen, während lange Trockenperioden zur Austrocknung von Ökosystemen und zur Verschlechterung der Wasserressourcen führen. @mt
title: Äärmuslik sademete hulk @et
description: In den letzten Jahrzehnten haben die atmosphärischen Konzentrationen von Treibhausgasen und Aerosolen vor allem infolge menschlicher Aktivitäten zugenommen. Ba é Dieser Anstieg führt zu erhöhten Temperaturen auf der Erde, zu Klimastörungen führt. Dieser Indikator bewertet das Ausmaß, in dem sich das Auftreten extremer Niederschläge in Belgien ändert. Immerhin können Perioden extremer Niederschläge zu Überschwemmungen führen, während lange Trockenperioden zur Austrocknung von Ökosystemen und zur Verschlechterung der Wasserressourcen führen. @ga
description: In den letzten Jahrzehnten haben die atmosphärischen Konzentrationen von Treibhausgasen und Aerosolen vor allem infolge menschlicher Aktivitäten zugenommen. Dieser Anstieg führt zu erhöhten Temperaturen auf der Erde, buvo zu Klimastörungen führt. Dieser Indikator bewertet das Ausmaß, in dem sich das Auftreten extremer Niederschläge in Belgien ändert. Immerhin können Perioden extremer Niederschläge zu Überschwemmungen führen, während lange Trockenperioden zur Austrocknung von Ökosystemen und zur Verschlechterung der Wasserressourcen führen. @lt
description: De laatste decennia nemen de atmosferische concentraties van broeikasgassen en aerosolen toe hoofdzakelijk ten gevolge van menselijke activiteiten. Die toename leidt tot verhoogde temperaturen op aarde, wat verstoring van het klimaat met zich meebrengt. Die verstoring kan bestaan uit wijzigende neerslagpatronen.Deze indicator gaat na in hoeverre er in België wijzigingen optreden in het voorkomen van periodes met extreme neerslag. Periodes met extreem veel neerslag kunnen immers leiden tot overstromingen, terwijl lange droge periodes leiden tot verdroging van ecosystemen en aantasting van de waterreserves. @nl
keyword: neerslagextremen @nl
landing page: https://vmm.vlaanderen.be/feiten-cijfers/klimaat/klimaatthemas/wateroverlast-door-hevige-regenval/indicator-neerslagextremen
title: Extreme Niederschläge @de
title: Ekstremne padavine @sl
issued: 2020-02-24
language: Dutch
title: Precipitații extreme @ro
description: In den letzten Jahrzehnten haben die atmosphärischen Konzentrationen von Treibhausgasen und Aerosolen vor allem infolge menschlicher Aktivitäten zugenommen. Dieser Anstieg führt zu erhöhten Temperaturen auf der Erde, oli zu Klimastörungen führt. Dieser Indikator bewertet das Ausmaß, in dem sich das Auftreten extremer Niederschläge in Belgien ändert. Immerhin können Perioden extremer Niederschläge zu Überschwemmungen führen, während lange Trockenperioden zur Austrocknung von Ökosystemen und zur Verschlechterung der Wasserressourcen führen. @et
title: Ekstremalne opady @pl
title: Ekstrēmi nokrišņi @lv
description: In den letzten Jahren haben die atmosphärischen Konzentrationen von Treibhausgasen und Aerosolen vor allen anderen Aktivitäten zugenommen. Erhöhte Temperaturen auf der Erde, was zu Klimastörungen. Indikator wie groß das Ausmaß, in dem sich das Auftreten extremer Niederschläge in Belgiensonder. Immerhin können Perioden extremer Niederschläge zu Überschwemmungen führen, eine lange Trockenperioden zur Austrocknung von Ökosystemen und zur Verschlechterung der Wasserressourcen führen. @de
description: U den letzten Jahrzehnten haben umrijeti atmosphärischen Konzentrationen von Treibhausgasen und Aerosolen vor allem infolge menschlicher Aktivitäten zugenommen. Dieser Anstieg führt zu erhöhten Temperaturen auf der Erde, bio je zu Klimastörungen führt. Dieser Indikator bewertet das Ausmaß, in dem sich das Auftreten extremer Niederschläge in Belgien ändert. Immerhin können Perioden extremer Niederschläge zu Überschwemmungen führen, während lange Trockenperioden zur Austrocknung von Ökosystemen und zur Verschlechterung der Wasserressourcen führen. @hr
title: Precipitação extrema @pt
title: Екстремни валежи @bg
description: V den letzten Jahrzehnten haben die atmosphärischen Konzentrationen von Treibhausgasen und Aerosolen vor allem infolge menschlicher Aktivitäten zugenommen. Dieser Anstieg führt zu erhöhten Temperaturen auf der Erde, je bil zu Klimastörungen führt. Dieser Indikator bewertet das Ausmaß, in dem sich das Auftreten extremer Niederschläge in Belgien ändert. Immerhin können Perioden extremer Niederschläge zu Überschwemmungen führen, während lange Trockenperioden zur Austrocknung von Ökosystemen und zur Verschlechterung der Wasserressourcen führen. @sl
description: V den letzten Jahrzehnten haben die atmosphärischen Konzentrationen von Treibhausgasen und Aerosolen vor allem infolge menschlicher Aktivitäten zugenommen. Dieser Anstieg führt zu erhöhten Temperaturen auf der Erde, byl zu Klimastörungen führt. Dieser Indikator bewertet das Ausmaß, in dem sich das Auftreten extremer Niederschläge v belgických spolkových zemích. Immerhin können Perioden extremer Niederschläge zu Überschwemmungen führen, während lange Trockenperioden zur Austrocknung von Ökosystemen und zur Verschlechterung der Wasserressourcen führen. @cs
description: In recent decades, atmospheric concentrations of greenhouse gases and aerosols have increased mainly as a result of human activities. That increase leads to increased temperatures on Earth, which entails climate disruption. This indicator assesses the extent to which changes occur in the occurrence of periods of extreme precipitation in Belgium. After all, periods of extreme precipitation can lead to flooding, while long dry periods lead to the desiccation of ecosystems and the degradation of water resources.
title: Precipitación extrema @es
title: Extreme precipitation
title: Äärimmäinen sademäärä @fi
description: In den letzten Jahrzehnten haben die atmosphärischen Konzentrationen von Treibhausgasen und Aerosolen vor allem infolge menschlicher Aktivitäten zugenommen. Dieser Anstieg führt zu erhöhten Temperaturen auf der Erde, var zu Klimastörungen führt. Dieser Indikator bewertet das Ausmaß, in dem sich das Auftreten extremer Niederschläge in Belgien ändert. Immerhin können Perioden extremer Niederschläge zu Überschwemmungen führen, während lange Trockenperioden zur Austrocknung von Ökosystemen und zur Verschlechterung der Wasserressourcen führen. @da
access rights: Toegang zonder voorwaarden
keyword: klimaatverandering @nl
title: Precipitazioni estreme @it
theme: ENVIRONMENT
title: Екстремальні опади @uk
title: Niederschlagsextreme @de
title: Neerslagextremen @nl
description: Au cours des dernières décennies, les concentrations atmosphériques de gaz à effet de serre et d'aérosols ont augmenté principalement en raison des activités humaines. Cette augmentation entraîne une augmentation des températures sur Terre, ce qui entraîne des perturbations climatiques. Cet indicateur évalue la mesure dans laquelle des changements se produisent dans l'occurrence des périodes de précipitations extrêmes en Belgique. Après tout, les périodes de précipitations extrêmes peuvent entraîner des inondations, tandis que les longues périodes sèches entraînent la dessiccation des écosystèmes et la dégradation des ressources en eau. @fr
title: Extrémne zrážky @sk
description: In den letzten Jahrzehnten haben die atmosphärischen Konzentrationen von Treibhausgasen und Aerosolen vor allem infolge menschlicher Aktivitäten zugenommen. Dieser Anstieg führt zu erhöhten Temperaturen auf der Erde, е zu Klimastörungen führt. Dieser Indikator bewertet das Ausmaß, in dem sich das Auftreten extremer Niederschläge in Belgien ändert. Immerhin können Perioden extremer Niederschläge zu Überschwemmungen führen, während lange Trockenperioden zur Austrocknung von Ökosystemen und zur Verschlechterung der Wasserressourcen führen. @bg
description: In den letzten Jahrzehnten haben die atmosphärischen Konzentrationen von Treibhausgasen und Aerosolen vor allem infolge menschlicher Aktivitäten zugenommen. Dieser Anstieg führt zu erhöhten Temperaturen auf der Erde, era zu Klimastörungen führt. Dieser Indikator bewertet das Ausmaß, in dem sich das Auftreten extremer Niederschläge in Belgien ändert. Immerhin können Perioden extremer Niederschläge zu Überschwemmungen führen, während lange Trockenperioden zur Austrocknung von Ökosystemen und zur Verschlechterung der Wasserressourcen führen. @it
title: Ekstremne oborine @hr
title: Extrémní srážky @cs
spatial: Flanders
title: Ακραία βροχόπτωση @el
description: In den letzten Jahrzehnten haben die atmosphärischen Konzentrationen von Treibhausgasen und Aerosolen vor allem infolge menschlicher Aktivitäten zugenommen. Dieser Anstieg führt zu erhöhten Temperaturen auf der Erde, foi zu Klimastörungen führt. Dieser Indikator bewertet das Ausmaß, in dem sich das Auftreten extremer Niederschläge in Belgien ändert. Immerhin können Perioden extremer Niederschläge zu Überschwemmungen führen, während lange Trockenperioden zur Austrocknung von Ökosystemen und zur Verschlechterung der Wasserressourcen führen. @pt
description: In den letzten Jahrzehnten haben die atmosphärischen Konzentrationen von Treibhausgasen und Aerosolen vor allem infolge menschlicher Aktivitäten zugenommen. Dieser Anstieg führt zu erhöhten Temperaturen auf der Erde, był zu Klimastörungen führt. Dieser Indikator bewertet das Ausmaß, in dem sich das Auftreten extremer Niederschläge in Belgien ändert. Immerhin können Perioden extremer Niederschläge zu Überschwemmungen führen, während lange Trockenperioden zur Austrocknung von Ökosystemen und zur Verschlechterung der Wasserressourcen führen. @pl
title: Ekstremalūs krituliai @lt
description: In den letzten Jahrzehnten haben die atmosphärischen Konzentrationen von Treibhausgasen und Aerosolen vor allem infolge menschlicher Aktivitäten zugenommen. Dieser Anstieg führt zu erhöhten Temperaturen auf der Erde, was zu Klimastörungen führt. Dieser Indikator bewertet das Ausmaß, in dem sich das Auftreten extremer Niederschläge in Belgien ändert. Immerhin können Perioden extremer Niederschläge zu Überschwemmungen führen, während lange Trockenperioden zur Austrocknung von Ökosystemen und zur Verschlechterung der Wasserressourcen führen.
description: Vuonna den letzten Jahrzehnten haben die atmosphärischen Konzentrationen von Treibhausgasen und Aerosolen vor allem infolge menschlicher Aktivitäten zugenommen. Dieser Anstieg führt zu erhöhten Temperaturen auf der Erde, tunnetuin esittäjä Klimastörungen führt Dieser Indikator bewertet das Ausmaß, in dem sich das Auftreten extremer Niederschläge in Belgien ändert. Immerhin können Perioden extremer Niederschläge zu Überschwemmungen führen, während lange Trockenperioden zur Austrocknung von Ökosystemen und zur Verschlechterung der Wasserressourcen führen. @fi
title: Ekstrem nedbør @da
description: In den letzten Jahrzehnten haben die atmosphärischen Konzentrationen von Treibhausgasen und Aerosolen vor allem infolge menschlicher Aktivitäten zugenommen. Dieser Anstieg führt zu erhöhten Temperaturen auf der Erde, був zu Klimastörungen führt. Dieser Indikator bewertet das Ausmaß, in dem sich das Auftreten extremer Niederschläge in Belgien ändert. Immerhin können Perioden extremer Niederschläge zu Überschwemmungen führen, während lange Trockenperioden zur Austrocknung von Ökosystemen und zur Verschlechterung der Wasserressourcen führen. @uk
contact point: Kind
  fn: Vlaamse Milieumaatschappij
  has URL: https://vmm.vlaanderen.be

Flanders Environment Agency
type: Organization
type: Regional Authority
name: Vlaamse Milieu Maatschappij @nl
type: Agent

Regional Authority
type: Concept
preferred label: Regionaal bestuur @nl
in scheme: http://purl.org/adms/publishertype/1.0

Maximale hoeveelheid neerslag gevallen op 1 dag of in een aaneensluitende period van 5, 10 of 15 dagen (Ukkel, vanaf 1880)
type: Distribution
title: Maximale hoeveelheid neerslag gevallen op 1 dag ta' een aaneensluitende period van 5, 10 ta' 15 dagen (Ukkel, vanaf 1880) @mt
description: Deze figuur geeft de evolutie weer van maximal hoeveelheid neerslag gevallen op 1 dag of in een aaneensluitende period van 5, 10 of 15 dagen in België (meetpunt Ukkel) sinds 1892. aastal. @et
title: Maximale hoeveelheid neerslag gevallen op 1 dag av i een aaneensluitende period van 5, 10 av 15 dagar (Ukkel, vanaf 1880) @sv
description: Deze figuur geeft de evolutie weer van maximal hoeveelheid neerslag gevallen op 1 dag of in een aaneensluitende period van 5, 10 of 15 dagen in België (meetpunt Ukkel) sinds 1892.
title: Maximale hoeveelheid neerslag gevallen op 1 dag in een aaneensluitende period van 5, 10 od 15 dagen (Ukkel, vanaf 1880) @hr
description: Deze figuur geeft de evolutie weer van maximal hoeveelheid neerslag gevallen op 1 dag of in een aaneensluitende period van 5, 10 iš 15 dagen in België (meetpunt Ukkel) sinds 1892. @lt
description: Deze figuur geeft de evolutie weer van maximum hoeveelheid neerslag gevallen op 1 dag of in een aaneensluitende period van 5, 10 of 15 dagen in België (meetpunt Ukkel) sinds 1892 (najstaršia verzia) @sk
title: Maximale hoeveelheid neerslag gevallen op 1 dag of in een aaneensluitende period van 5, 10 of 15 dagen (Ukkel, vanaf 1880) Näytä tarkat tiedot @fi
title: Maximale hoeveelheid neerslag gevallen op 1 dag of in een aaneensluitende periode van 5, 10 of 15 dagen (Ukkel, vanaf 1880) @nl
language: Dutch
title: Maximale hoeveelheid neerslag gevallen op 1 dag of in een aaneensluitende period van 5, 10 of 15 dagen (Ukkel, vanaf 1880) - Egészségfigyelő @hu
title: Maximale hoeveelheid neerslag gevallen op 1 dag της περιόδου een aaneensluitende van 5, 10 της 15 dagen (Ukkel, vanaf 1880) @el
description: Deze figuur geeft de evolutie weer van maximal hoeveelheid neerslag gevallen op 1 dag di in een aaneensluitende period van 5, 10 di 15 dagen in België (meetpunt Ukkel) sinds 1892. @it
description: Přidat štítky pro "Deze figuur geeft de evolutie weer van maximal hoeveelheid neerslag gevallen op 1 dag of in een aaneensluitende period van 5, 10 of 15 dagen in België (meetpunt Ukkel) sinds 1892.". @cs
title: Maximale hoeveelheid neerslag gevallen op 1 dag of în een aaneensluitende period van 5, 10 of 15 dagen (Ukkel, vanaf 1880) @ro
description: Deze figuur geeft de evolutie weer van maximal hoeveelheid neerslag gevallen op 1 dag от in een aaneensluitende period van 5, 10 от 15 dagen in België (meetpunt Ukkel) sinds 1892. @bg
availability: AVAILABLE
title: Maximale hoeveelheid neerslag gevallen op 1 dag in een aaneensluitende period van 5, 10 of 15 dagen (Ukkel, vanaf 1880 г.) @bg
title: Maximale hoeveelheid neerslag gevallen op 1 dag of in een aaneensluitende period van 5, 10 of 15 dagen (Ukkel, vanaf 1880) Systémové požadavky @cs
title: Maximale hoeveelheid neerslag gevallen op 1 dag of in een aaneensluitende period van 5, 10 of 15 dagen (Ukkel, vanaf 1880) Sistēmas Prasības @lv
format: CSV
description: Deze figuur geeft de evolutie weer van maximal hoeveelheid neerslag gevallen op 1 dag av i een aaneensluitende period van 5, 10 av 15 dagar i België (meetpunt Ukkel) sjunker 1892. @sv
description: Deze figuur geeft de evolutie weer van maximale hoeveelheid neerslag gevallen op 1 dag of in een aaneensluitende periode van 5, 10 of 15 dagen in België (meetpunt Ukkel) sinds 1892. @nl
title: Maximale hoeveelheid neerslag gevallen op 1 dag of in een aaneensluitende period van 5, 10 of 15 dagen (Ukkel, vanaf 1880) - opinie, recenzje użytkowników, ekspertów, porównanie cen. - alaTest.pl @pl
download URL: https://vmm.vlaanderen.be/feiten-cijfers/klimaat/klimaatthemas/wateroverlast-door-hevige-regenval/indicator-neerslagextremen/maximale-neerslag/@@download/csv
media type: text/csv
title: Maximale hoeveelheid neerslag gevallen op 1 dag di in een aaneensluitende period van 5, 10 di 15 dagen (Ukkel, vanaf 1880) @it
description: Deze figuur geeft de evolutie weer van maximal hoeveelheid neerslag gevallen op 1 dag in een aaneensluitende period van 5, 10 od 15 dagen in België (meetpunt Ukkel) griješi 1892. @hr
description: Deze figuur geeft de evolutie weer van maximal hoeveelheid neerslag gevallen op 1 dag of in een aaneensluitende period van 5, 10 no 15 dagen in België (meetpunt Ukkel) sinds 1892. @lv
title: Maximale hoeveelheid neerslag gevallen op 1 dag of in een aaneensluitende period van 5, 10 iš 15 dagen (Ukkel, vanaf 1880) @lt
description: Deze figuur geeft de evolutie weer van maximum hoeveelheid neerslag gevallen op 1 dag of in een aaneensluitende period van 5, 10 of 15 dagen in België (meetpunt Ukkel) sinds 1892. @de
license: Vlaamse Open Data licentie gratis hergebruik
access URL: https://metadata.vlaanderen.be/srv/dut/catalog.search#/metadata/69dc54b8-3057-31ea-91c3-d4095e807ae3

Dutch
type: LinguisticSystem
in scheme: language
preferred label: néerlandais @fr
preferred label: Niederländisch @de
type: Concept
preferred label: Néerlandais @fr
preferred label: Nederlands @nl

CSV
type: MediaTypeOrExtent
in scheme: file-type
type: Concept

text/csv
type: Concept
in scheme: media-types
type: MediaType

Vlaamse Open Data licentie gratis hergebruik
type: LicenseDocument
type: Attribution

Attribution
type: Concept
in scheme: http://purl.org/adms/licencetype/1.0
notation: Attribution
type: LicenseDocument
preferred label: Naamsvermelding @nl
preferred label: Verplichte bronvermelding @nl

Aantal dagen met zware neerslag (= 20.0 mm per dag) te Ukkel (vanaf 1951)
type: Distribution
title: Aantal dagen met zware neerslag (= 20,0 mm per dag) te Ukkel (vanaf 1951) @nl
availability: AVAILABLE
title: Aantal dagen met zware neerslag (= 20,0 mm na dag) te Ukkel (vanaf 1951) @cs
description: Laatste decennia nemen de atmosferische concentraties van broeikasgassen en aerosolen toe hoofdzakelijk ten gevolge van menselijke activiteiten (Концентрации в областта на аерозолните пръсти). Die toename leidt tot verhoogde temperaturen op aarde, wat verstoring van het klimaat срещна zich meebrengt. Die verstoring kan bestaan uit wijzigende neerslagpatronen.Deze indicator gaat na in hoeverre er in België wijzigingen optreden in het voorkomen van periods met extreme neerslag. Периоди, изпълнени extreem veel neerslag kunnen immers leiden tot overstromingen, terwijl lange droge periods leiden tot verdroging van ecosystemen en aantasting van de waterreserves. @bg
language: Dutch
description: Laatste decennia nemen de atmosferische concentraties van broeikasgassen en aerosolen toe hoofdzakelijk ten gevolge van menselijke activiteiten. Die toename leidt tot verhoogde temperaturen op aarde, wat verstoring van het klimaat laħqu zich meebrengt. Die verstoring kan bestaan uit wijzigende neerslagpatronen.Deze indikatur gaat na in hoeverre er in België wijzigingen optreden in het voorkomen van periods sodisfatti neerslag estremi. Perjodi sodisfatti extreem veel neerslag kunnen immers leiden tot overstromingen, terwijl lange droge perjodi leiden tot verdroging van ecosystemen en aantasting van de waterreserves. @mt
description: Laatste decennia nemen de atmosferische concentraties van broeikasgassen en aerosolen toe hoofdzakelijk ten gevolge van menselijke activiteiten. Die toename leidt tot verhoogde temperaturen op aarde, wat verstoring van het klimaat met zich meebrengt. Die verstoring kan bestaan uit wijzigende neerslagpatronen.Deze indicator gaat na in hoeverre er in België wijzigingen optreden in het voorkomen van periods met extreme neerslag. Periods met extreem veel neerslag kunnen immers leiden tot overstromingen, terwijl lange droge periods leiden tot verdroging van ecosystemen en aantasting van de waterreserves.
title: Aantal dagen täidetud zware neerslag (= 20,0 mm per dag) te Ukkel (vanaf 1951) @et
title: Το Aantal dagen συνάντησε το zware neerslag (= 20,0 mm ανά dag) te Ukkel (vanaf 1951) @el
description: Laatste decennia nemen de atmosferische concentraties van broeikasgassen en aerosolen toe hoofdzakelijk ten gevolge van menselijke activiteiten. Die toename leidt tot verhoogde temperaturen op aarde, wat verstoring van het klimaat met zich meebrengt. Die verstoring kan bestaan uit wijzigende neerslagpatronen.Deze indicator gaat na in hoeverre er in België wijzigingen optreden in het voorkomen van periods met extreme neerslag. Laikotarpiai susitiko extreem veel neerslag kunnen immers leiden tot overstromingen, terwijl lange droge laikotarpiai leiden tot verdroging van ecosystemen en aantasting van de waterreserves. @lt
description: Laatste decennia nemen de atmosferische concentraties van broeikasgassen en aerosolen toe hoofdzakelijk ten gevolge van menselijke activiteiten. Die toename leidt tot verhoogde temperaturen op aarde, wat verstoring van het klimaat met zich meebrengt. Die verstoring kan bestaan uit wijzigende neerslagpatronen.Deze δείκτης gaat na σε hoeverre er σε België wijzigingen optreden σε het voorkomen van περιόδους συνάντησε ακραία neerslag. Περίοδοι που συναντήθηκαν extreem veel neerslag kunnen immers leiden tot overstromingen, terwijl lange droge περίοδοι leiden tot verdroging van ecosystemen en aantasting van de waterreserves. @el
title: Aantal dagen mødte zware neerslag (= 20,0 mm pr. dag) te Ukkel (vanaf 1951) @da
title: Bhuail Aantal dagen le neerslag zware (= 20.0 mm in aghaidh an dag) te Ukkel (vanaf 1951) @ga
description: Laatste decennia nemen de atmosferische concentraties van broeikasgassen en aerosolen toe hoofdzakelijk ten gevolge van menselijke activiteiten. Leírás: Leidt tot verhoogde temperaturen op aarde, wat verstoring van het klimaat met zich meebrengt. Szálláshelyek a(z) Bestaan uit wijzigende neerslagpatronen.Deze indicator gaat na in hoeverre er in België wijzigingen optreden in het voorkomen van periods met extreme neerslag. Időszakok találkozott extreem veel neerslag kunnen immers leiden tot overstromingen, terwijl lange droge időszakok leiden tot verdroging van ecosystemen en aantasting van de waterreserves. @hu
title: Aantal dagen met zware neerslag (= 20,0 mm po dag) te Ukkel (vanaf 1951) @hr
description: Laatste decennia nemen de atmosferische concentraties van broeikasgassen en aerosolen toe hoofdzakelijk ten gevolge van menselijke activiteiten. Die toename leidt tot verhoogde temperaturen op aarde, wat verstoring van het klimaat met zich meebrengt. Die verstoring kan bestaan uit wijzigende neerslagpatronen.Deze indicatore gaat na in hoeverre er in België wijzigingen optreden in het voorkomen van periodi incontrato neerslag estremo. Periodi incontrati extreem veel neerslag kunnen immers leiden tot overstromingen, terwijl lange droge periodi leiden tot verdroging van ecosystemen en aantasting van de waterreserves. @it
license: Vlaamse Open Data licentie gratis hergebruik
access URL: https://metadata.vlaanderen.be/srv/dut/catalog.search#/metadata/69dc54b8-3057-31ea-91c3-d4095e807ae3
title: Aantal dagen met zware neerslag (= 20,0 mm par dag) te Ukkel (vanaf 1951) @lv
title: Aantal dagen met zware neerslag (= 20.0 мм на даг) te Ukkel (vanaf 1951) @uk
description: Laatste decennia nemen de atmosferische concentraties van broeikasgassen en aerosolen toe hoofdzakelijk ten gevolge van menselijke activiteiten. Die toename leidt tot verhoogde temperaturen op aarde, wat verstoring van het klimaat met zich meebrengt Näytä tarkat tiedot Die verstoring kan bestaan uit wijzigende neerslagpatronen.Deze indicator gaat na in hoeverre er in België wijzigingen optreden in het voorkomen van periods met extreme neerslag. Ajat tapasivat extreem veel neerslag kunnen immers leiden tot overstromingen, terwijl lange droge periods leiden tot verdroging van ecosystemen en aantasting van de waterreserves. @fi
description: De laatste decennia nemen de atmosferische concentraties van broeikasgassen en aerosolen toe hoofdzakelijk ten gevolge van menselijke activiteiten. Die toename leidt tot verhoogde temperaturen op aarde, wat verstoring van het klimaat met zich meebrengt. Die verstoring kan bestaan uit wijzigende neerslagpatronen.Deze indicator gaat na in hoeverre er in België wijzigingen optreden in het voorkomen van temps met extreme neerslag. Perioden met extreem veel neerslag kunnen Immers Leiden tot overstromingen, terwijl lange droge Perioden Leiden tot verdroging van ecosystemen en aantasting van de waterreserves. @de
title: Aantal dagen met zware neerslag (= 20,0 mm por dag) te Ukkel (vanaf 1951) @pt
description: Laatste decennia nemen de atmosferische concentraties van broeikasgassen en aerosolen toe hoofdzakelijk ten gevolge van menselijke activiteiten. Die toename leidt tot verhoogde temperaturen op aarde, wat verstoring van het klimaat met zich meebrengt. Die verstoring kan bestaan uit wijzigende neerslagpatronen.Deze indicator gaat na in hoeverre er in België wijzigingen optreden in het voorkomen van periods met extreme neerslag. Los períodos se encontraron con extreem veel neerslag kunnen immers leiden tot overstromingen, terwijl lange droge periods leiden tot verdroging van ecosystemen en aantasting van de waterreserves. @es
description: Laatste decennia nemen de atmosferische concentraties van broeikasgassen en aerosolen toe hoofdzakelijk ten gevolge van menselijke activiteiten. Die toename leidt tot verhoogde temperaturen op aarde, wat verstoring van het klimaat met zich meebrengt. Die verstoring kan bestaan uit wijzigende neerslagpatronen.Deze indicator gaat na in hoeverre er in België wijzigingen optreden in het voorkomen van periods met extreme neerslag. Періоди зустрілися extreem veel neerslag kunnen immers leiden tot overstromingen, terwijl lange droge periods leiden tot verdroging van ecosystemen en aantasting van de waterreserves. @uk
title: Aantal dagen met zware neerslag (= 20,0 mm на dag) te Ukkel (vanaf 1951 г.) @bg
description: Laatste decennia nemen de atmosferische concentraties van broeikasgassen en aerosolen toe hoofdzakelijk ten gevolge van menselijke activiteiten. Die toename leidt tot verhoogde temperaturen op aarde, wat verstoring van het klimaat met zich meebrengt. Die verstoring kan bestaan uit wijzigende neerslagpatronen.Deze indicator gaat na in hoeverre er in België wijzigingen optreden in het voorkomen van periods met extreme neerslag. Okresy spełnione extreem veel neerslag kunnen immers leiden tot overstromingen, terwijl lange droge period leiden tot verdroging van ecosystemen en aantasting van de waterreserves. @pl
title: Aantal dagen met zware neerslag (= 20,0 mm na dag) te Ukkel (vanaf 1951) - opinie, recenzje użytkowników, ekspertów, porównanie cen. - alaTest.pl @pl
title: Aantal dagen met zware neerslag (= 20,0 mm per dag) te Ukkel (vanaf 1951 m.) @lt
download URL: https://vmm.vlaanderen.be/feiten-cijfers/klimaat/klimaatthemas/wateroverlast-door-hevige-regenval/indicator-neerslagextremen/zware-neerslag/@@download/csv
format: CSV
description: Laatste decennia nemen de atmosferische concentraties van broeikasgassen en aerosolen ladhar hoofdzakelijk deich gevolge van menselijke activiten. Die toename leidt tot verhoogde temperaturen op aarde, wat verstoring van het klimaat bhuail zich meebrengt. Die verstoring kan bestaan uit wijzigende neerslagpatronen.Deze táscaire gaat na in hoeverre er i België wijzigingen optreden i dtréimhsí veain het voorkomen bhuail neerslag mhór. Tréimhsí le chéile extreem veel neerslag kunnen tumadóirí leiden tot overstromingen, terwijl lange droge tréimhsí leiden tot verdroging van ecosystemen en aantasting van de waterreserves. @ga
title: Aantal dagen met zware neerslag (= 20.0 mm għal kull dag) te Ukkel (vanaf 1951) @mt
title: Aantal dagen met bine neerslag (= 20,0 mm per dag) te Ukkel (vanaf 1951) @de
media type: text/csv
description: Laatste decennia nemen de atmosferische concentraties van broeikasgassen en aerosolen toe hoofdzakelijk ten gevolge van menselijke activiteiten (în engleză). Die toename leidt tot verhoogde temperaturen op aarde, wat verstoring van het klimaat met zich meebrengt. Die verstoring kan bestaan uit wijzigende neerslagpatronen.Deze indicator gaat na in hoeverre er in België wijzigingen optreden in het voorkomen van periods met extreme neerslag. Perioade întâlnite extreem veel neerslag kunnen immers leiden tot overstromingen, terwijl lange droge period leiden tot verdroging van ecosystemen en aantasting van de waterreserves. @ro
title: Aantal dagen met zware neerslag (= 20,0 mm per dag) te Ukkel (vanaf 1951)[szerkesztés] @hu
description: Laatste decennia nemen de atmosferische concentraties van broeikasgassen en aerosolen toe hoofdzakelijk ten gevolge van menselijke activiteiten. Die toename leidt tot verhoogde temperaturen op aarde, wat verstoring van het klimaat srečal zich meebrengt. Die verstoring kan bestaan uit wijzigende neerslagpatronen.Deze indikator gaat na in hoeverre er v België wijzigingen optreden in het voorkomen van period met extreme neerslag. Obdobja srečal extreem veel neerslag kunnen immers leiden tot overstromingen, terwijl lange droge obdobja leiden tot verdroging van ecosystemen en aantasting van de waterreserves. @sl
description: Laatste decennia nemen de atmosferische concentraties van broeikasgassen en aerosolen toe hoofdzakelijk ten gevolge van menselijke activiteiten. Die toename leidt tot verhoogde temperaturen op aarde, wat verstoring van het klimaat met zich meebrengt. Die verstoring kan bestaan uit wijzigende neerslagpatronen.Deze indikator gaat na in hoeverre er i België wijzigingen optreden in het voorkomen van perioder mødte ekstreme neerslag. Perioder mødte extreem veel neerslag kunnen nedsænkning leiden tot overstromingen, terwijl lange droge perioder leiden tot verdroging van ecosystemen en aantasting van de waterreserves. @da
description: Laatste decennia nemen de atmosferische concentraties van broeikasgassen en aerosolen toe hoofdzakelijk ten gevolge van menselijke activiteiten. Die toename leidt tot verhoogde temperaturen op aarde, wat verstoring van het klimaat met zich meebrengt. Die verstoring kan bestaan uit wijzigende neerslagpatronen.Deze indikaator gaat na in hoeverre er in België wijzigingen optreden in het voorkomen van periods met extreme neerslag. Perioodid kohtusid extreem veel neerslag kunnen immers leiden tot overstromingen, terwijl lange droge periods leiden tot verdroging van ecosystemen en aantasting van de waterreserves. @et
description: Laatste decennia nemen de atmosferische concentraties van broeikasgassen en aerosolen toe hoofdzakelijk ten gevolge van menselijke activiteiten (em inglês). Die toename leidt tot verhoogde temperaturen op aarde, wat verstoring van het klimaat met zich meebrengt. Die verstoring kan bestaan uit wijzigende neerslagpatronen.Deze indicator gaat na in hoeverre er in België wijzigingen optreden in het voorkomen van periods met extreme neerslag. Periods met extreem veel neerslag kunnen immers leiden tot overstromingen, terwijl lange droge periods leiden tot verdroging van ecosystemen en aantasting van de waterreserves. @pt
title: Aantal dagen met zware neerslag (= 20,0 mm per dag) te Ukkel (vanaf 1951) (în limba engleză) @ro
description: Laatste decennia nemen de atmosferische concentraties van broeikasgassen en aerosolen toe hoofdzakelijk ten gevolge van menselijke activiteiten. Zomrieť toename leidt tot verhoogde temperaturen op aarde, wat verstoring van het klimaat met zich meebrengt. Die verstoring kan bestaan uit wijzigende neerslagpatronen.Deze indikátor gaat na in hoeverre er in België wijzigingen optreden in het voorkomen van periods met extreme neerslag. Periódy splnené extreem veel neerslag kunnen immers leiden tot overstromingen, terwijl lange droge periods leiden tot verdroging van ecosystemen en aantasting van de waterreserves. @sk
description: Laatste decennia nemen de atmosferische concentraties van broeikasgassen en aerosolen toe hoofdzakelijk ten gevolge van menselijke activiteiten (Laatste decennia nemen de atmosferische concentraties van broeikasgassen en aerosolen toe hoofdzakelijk ten gevolge van menselijke activiteiten). Die toename leidt tot verhoogde temperaturen op aarde, wat verstoring van het klimaat met zich meebrengt. Die verstoring kan bestaan uit wijzigende neerslagpatronen.Deze indicator gaat na in hoeverre er in België wijzigingen optreden in het voorkomen van periods met extreme neerslag. Perioder mötte extreem veel neerslag kunnen immers leiden tot overstromingen, terwijl lange droge periods leiden tot verdroging van ecosystemen en aantasting van de waterreserves. @sv
title: Aantal dagen met zware neerslag (= 20,0 mm per päivä) te Ukkel (vanaf 1951) @fi
description: Laatste decennia nemen de atmosferische concentraties van broeikasgassen en aerosolen toe hoofdzakelijk ten gevolge van menselijke activiteiten. [Více informací] Die toename leidt tot verhoogde temperaturen op aarde, wat verstoring van het klimaat met zich meebrengt. [Překlad názvu] Die verstoring kan bestaan uit wijzigende neerslagpatronen.Deze indikátor gaat na in hoeverre er in België wijzigingen optreden in het voorkomen van periods met extreme neerslag. Období setkal extreem veel neerslag kunnen immers leiden tot overstromingen, terwijl lange droge periods leiden tot verdroging van ecosystemen en aantasting van de waterreserves. @cs
description: Laatste decennia nemen de atmosferische koncentraties van broeikasgassen en aerosolen toe hoofdzakelijk ten gevolge van menselijke activiteiten. Umri toename leidt tot verhoogde temperaturen op aarde, wat verstoring van het klimaat met zich meebrengt. Umri verstoring kan bestaan uit wijzigende neerslagpatronen.Deze indikator gaat na in hoeverre er u België wijzigingen optreden u het voorkomen van razdoblja susreo ekstremne neerslag. Razdoblja su se susrela s ekstremnim veel neerslag kunnen immers leiden tot overstromingen, terwijl lange droge razdoblja leiden tot verdroging van ecosystemen en aantasting van de waterreserves. @hr
description: Laatste decennia nemen de atmosferische concentraties van broeikasgassen en aerosolen toe hoofdzakelijk ten gevolge van menselijke activiteiten. Die toename leidt tot verhoogde temperaturen op aarde, wat verstoring van het klimaat met zich meebrengt. Die verstoring kan bestaan uit wijzigende neerslagpatronen.Deze indicator gaat na in hoeverre er in België wijzigingen optreden in het voorkomen van periods met extreme neerslag. Periodi tikās extreem veel neerslag kunnen iegremdē leiden tot overstromingen, terwijl lange droge periodi leiden tot verdroging van ecosystemen en aantasting van de waterreserves. @lv
description: De laatste decennia nemen de atmosferische concentraties van broeikasgassen en aerosolen toe hoofdzakelijk ten gevolge van menselijke activiteiten. Die toename leidt tot verhoogde temperaturen op aarde, wat verstoring van het klimaat met zich meebrengt. Die verstoring kan bestaan uit wijzigende neerslagpatronen.Deze indicator gaat na in hoeverre er in België wijzigingen optreden in het voorkomen van periodes met extreme neerslag. Periodes met extreem veel neerslag kunnen immers leiden tot overstromingen, terwijl lange droge periodes leiden tot verdroging van ecosystemen en aantasting van de waterreserves. @nl

Toegang zonder voorwaarden
type: Concept
preferred label: public
preferred label: without conditions
in scheme: access-right
type: RightsStatement
preferred label: öffentlich @de
preferred label: publiek
preferred label: openbaar @nl
preferred label: publicly available
preferred label: Public

ENVIRONMENT
type: Concept
in scheme: data-theme
preferred label: Milieu @nl
preferred label: Environnement @fr
preferred label: Umwelt @de
preferred label: Environment

Langste droogteperiode in een jaar en in een groeiseizoen (Ukkel, 1880)
type: Distribution
description: Deze figuur geeft de evolutie weer van de langste droogteperiode in een jaar en in een groeiseizoen in België (meetpunt Ukkel) griješi 1892. @hr
description: Deze figuur geeft de evolutie weer van de langste droogteperiode in een jaar en in een groeiseizoen in België (meetpunt Ukkel) sinds 1892. aastal. @et
license: Vlaamse Open Data licentie gratis hergebruik
description: Deze figuur geeft de evolutie weer van de langste droogteperiode in een jaar en in een groeiseizoen in België (meetpunt Ukkel) sinds 1892.
description: V tomto článku byl použit překlad textu z článku Deze figuur geeft de evolutie weer van de langste droogteperiode in een jaar en in een groeiseizoen na anglické Wikipedii. @cs
title: Langste droogteperiode in een jaar en in een groeiseizoen (Ukkel, 1880 m.) @lt
language: Dutch
title: Langste droogteperiode in een jaar en in een groeiseizoen (Ουκέλ, 1880) @el
title: Langste droogteperiode in een jaar en in een groeiseizoen (Ukkel, 1880.) @hr
description: Deze figuur geeft de evolutie weer van de langste droogteperiode in een jaar en in een groeiseizoen in België (συνάντηση Ukkel) sinds 1892. @el
media type: text/csv
description: Deze figuur geeft de evolutie weer van de langste droogteperiode in een jaar en in een groeiseizoen in België (Ukkel találkozója) sinds 1892. @hu
title: Langste droogteperiode in een jaar en in een groeiseizoen (Уккель, 1880) @uk
format: CSV
download URL: https://vmm.vlaanderen.be/feiten-cijfers/klimaat/klimaatthemas/wateroverlast-door-hevige-regenval/indicator-neerslagextremen/langste-droogte/@@download/csv
title: Szerző Téma: Langste droogteperiode in een jaar en in een groeiseizoen (Ukkel, 1880) (Megtekintve 3 alkalommal) @hu
availability: AVAILABLE
title: Langste droogteperiode in een jaar en in een groeiseizoen (Укел, 1880 г.) @bg
title: Langste droogteperiode in een jaar en in een groeiseizoen (Ukkel, 1880)[editovat | editovat zdroj] @cs
description: Deze figuur geeft de evolutie weer van de langste droogteperiode in een jaar en in een groeiseizoen in België (среща с Ukkel) sinds 1892. @bg
description: Deze figuur geeft de evolutie weer van de langste droogteperiode in een jaar en in een groeiseizoen in België (meetpunt Ukkel) sinds 1892 Näytä tarkat tiedot @fi
title: Langste droogteperiode in een jaar en in een groeiseizoen (Ukkel, 1880) - Kto odpowiedział? @pl
description: Deze figuur geeft de evolutie weer van de langste droogteperiode in een jaar en in een groeiseizoen in België (meetpunt Ukkel) nugrimzdo 1892 m. @lt
access URL: https://metadata.vlaanderen.be/srv/dut/catalog.search#/metadata/69dc54b8-3057-31ea-91c3-d4095e807ae3
description: Deze figuur geeft de evolutie weer van de langste droogteperiode in een jaar en in een groeiseizoen in België (meetpunt Ukkel) sinds 1892[upraviť upraviť zdroj] @sk
description: Deze figuur geeft de evolutie weer van de langste droogteperiode in een jaar en in een groeiseizoen in België (meetpunt Ukkel) șinds 1892. @ro
description: Deze figuur geeft de evolutie weer van de langste droogteperiode in een jaar en in een groeiseizoen in België (möte Ukkel) sjönk 1892. @sv
description: Deze figuur geeft de evolutie weer van de langste droogteperiode in een jaar en in een groeiseizoen v België (srečni Ukkel) greši 1892. @sl
title: Långste droogteperiode in een jaar en in een groeiseizoen (Ukkel, 1880) @sv
title: Langste droogteperiode in een jaar en in een groeiseizoen (Ukkel, 1880) Sistēmas Prasības @lv
title: Langste droogteperiode in een jaar en in een groeiseizoen (Ukkel, 1880) Näytä tarkat tiedot @fi
title: Langste droogteperiode in een jaar și in een groeiseizoen (Ukkel, 1880) @ro
description: Deze figuur geeft de evolutie weer van de langste droogteperiode in een jaar en in een groeiseizoen sa Bheilg (meetpunt Ukkel) sinds 1892. @ga

Flanders
type: Location