WCS- Publieke Download Service van Vlaamse Overheid - beleidsdomein Omgeving - samenwerkingsverband MercatorNet
type: DataService
endpoint URL: https://www.mercator.vlaanderen.be/raadpleegdienstenmercatorpubliek/ows
subject: OGCWMS
subject: OGCWCS
description: WCS - Öffentlicher Downloaddienst der Flämischen Regierung - Politikbereich Umwelt - Partnerschaft MercatorNet @de
title: WCS- Öffentlicher Download Service der Flämischen Regierung - Politikbereich Umwelt - Partnerschaft MercatorNet @de
conforms to: Technical Guidance for the implementation of INSPIRE Download Services
title: WCS- Service public de téléchargement du gouvernement flamand - domaine politique Environnement - Partenariat MercatorNet @fr
subject: infoMapAccessService
keyword: WMS
description: WCS - Publieke Download Service van Vlaamse Overheid - beleidsdomein Omgeving - samenwerkingsverband MercatorNet
subject: infoCoverageAccessService
spatial: Flanders
title: WMS - Publieke View Service van Vlaamse Overheid - beleidsdomein Omgeving - samenwerkingsverband MercatorNet
identifier: Identifier
  notation: WCS- Publieke Download Service van Vlaamse Overheid - beleidsdomein Omgeving - samenwerkingsverband MercatorNet
keyword: GDI-MercatorNet
keyword: MercatorNet
keyword: WCS
keyword: Vlaanderen
title: WCS- Public Download Service of the Flemish Government - policy area Environment - MercatorNet partnership @en
description: WCS - Service public de téléchargement du gouvernement flamand - domaine politique Environnement - Partenariat MercatorNet @fr
keyword: View Service
description: WMS - Publieke View Service van Vlaamse Overheid - beleidsdomein Omgeving - samenwerkingsverband MercatorNet
keyword: OpenbareMetadata
landing page: https://www.vlaanderen.be/DataCatalogRecord/6f8c1407-e109-f598-32c7-a068-2298-bdde-122da642
applicable legislation: oj
modified: 2022-03-04
endpoint description: https://www.mercator.vlaanderen.be/raadpleegdienstenmercatorpubliek/ows
access rights: openbaar
conforms to: Technical Guidance for the implementation of INSPIRE Discovery Services
publisher: Departement Omgeving
landing page: https://www.vlaanderen.be/DataCatalogRecord/1af7f4fc-bb73-469f-9001-019c103b695f
contact point: Kind
  fn: MercatorNet
identifier: Identifier
  notation: WCS- Publieke Download Service van Vlaamse Overheid - beleidsdomein Omgeving - samenwerkingsverband MercatorNet
keyword: Download Service
description: WCS - Public Download Service of the Flemish Government - policy area Environment - MercatorNet partnership @en
conforms to: OGC:WMS

Technical Guidance for the implementation of INSPIRE Download Services
type: Standard

http://data.gov.be/.well-known/genid/rights/f011858c7e4c5d141b423b4302e9bfc0783c3a5f
type: RightsStatement
title: Le service peut être utilisé par n'importe qui. Le prestataire du service ne donne aucune garantie quant au fonctionnement du service, ni quant à l'exactitude des informations proposées. En utilisant le service, chaque utilisateur ou consultant s'engage à respecter les dispositions d'accès et d'utilisation des données fournies dans le service. Veuillez vous référer aux dispositions relatives à l'accès et à l'utilisation dans les métadonnées de tous les ensembles de données proposés dans le service. Lors de l'utilisation du service, le fournisseur du service traite les données du consultant. Ces informations concernant l'enregistrement et le stockage des données de l'utilisateur par le fournisseur doivent toujours être communiquées au préalable par le fournisseur au consultant. @fr
title: Der Dienst kann von jedem genutzt werden. Der Anbieter des Dienstes gibt keine Garantien in Bezug auf den Betrieb des Dienstes, noch in Bezug auf die Richtigkeit der angebotenen Informationen. Durch die Nutzung des Dienstes verpflichtet sich jeder Nutzer oder Berater, die Zugangs- und Nutzungsbestimmungen der im Dienst bereitgestellten Daten einzuhalten. Bitte beachten Sie die Zugriffs- und Nutzungsbestimmungen in den Metadaten aller im Service angebotenen Datensätze. Bei der Nutzung des Dienstes verarbeitet der Anbieter des Dienstes die Daten des Beraters. Diese Informationen über die Protokollierung und Speicherung der Daten des Nutzers durch den Anbieter muss der Anbieter dem Berater immer im Voraus mitteilen. @de
title: The service can be used by anyone. The provider of the service gives no guarantees with regard to the operation of the service, nor with regard to the accuracy of the information offered. By using the service, each user or consultant undertakes to comply with the access and use provisions of the data provided in the service. Please refer to the access and usage provisions in the metadata of all datasets offered in the service. When using the service, the provider of the service processes the data of the consultant. This information regarding the logging and storage of the user's data by the provider must always be communicated by the provider to the consultant in advance. @en
title: De service kan door iedereen gebruikt worden. De aanbieder van de service geeft geen garanties t.a.v. de werking van de service, noch t.a.v. de juistheid van de aangeboden informatie. Door het gebruik van de service verbindt elke gebruiker of raadpleger er zich toe om zich te houden aan de toegangs- en gebruiksbepalingen van de in de service aangeboden gegevens. Gelieve de toegangs- en gebruiksbepalingen te raadplegen in de metadata van alle datasets die in de service worden aangeboden. Bij het gebruik van de service verwerkt de aanbieder van de service het de gegevens van de raadpleger. Deze informatie met betrekking tot de loggen en bewaren van gegevens van de gebruiker door de aanbieder moet altijd voorafgaandelijk door de aanbieder gecommuniceerd worden aan de raadpleger.

Flanders
type: Location

http://data.gov.be/.well-known/genid/rights/62ba9ee54f327dfc5f0deec1dcbcdafc626ea50f
type: RightsStatement
title: De service kan door iedereen gebruikt worden. De aanbieder van de service geeft geen garanties t.a.v. de werking van de service, noch t.a.v. de juistheid van de aangeboden informatie. Door het gebruik van de service verbindt elke gebruiker of raadpleger er zich toe om zich te houden aan de toegangs- en gebruiksbepalingen van de in de service aangeboden gegevens. Gelieve de toegangs- en gebruiksbepalingen te raadplegen in de metadata van alle datasets die in de service worden aangeboden. Bij het gebruik van de service verwerkt de aanbieder van de service het de gegevens van de raadpleger. Deze informatie met betrekking tot de loggen en bewaren van gegevens van de gebruiker door de aanbieder moet altijd voorafgaandelijk door de aanbieder gecommuniceerd worden aan de raadpleger.
title: Le service peut être utilisé par n'importe qui. Le prestataire du service ne donne aucune garantie quant au fonctionnement du service, ni quant à l'exactitude des informations proposées. En utilisant le service, chaque utilisateur ou consultant s'engage à respecter les dispositions d'accès et d'utilisation des données fournies dans le service. Veuillez vous référer aux dispositions relatives à l'accès et à l'utilisation dans les métadonnées de tous les ensembles de données proposés dans le service. Lors de l'utilisation du service, le fournisseur du service traite les données du consultant. Ces informations concernant l'enregistrement et le stockage des données de l'utilisateur par le fournisseur doivent toujours être communiquées au préalable par le fournisseur au consultant. @fr
title: Der Dienst kann von jedem genutzt werden. Der Anbieter des Dienstes gibt keine Garantien in Bezug auf den Betrieb des Dienstes, noch in Bezug auf die Richtigkeit der angebotenen Informationen. Durch die Nutzung des Dienstes verpflichtet sich jeder Nutzer oder Berater, die Zugangs- und Nutzungsbestimmungen der im Dienst bereitgestellten Daten einzuhalten. Bitte beachten Sie die Zugriffs- und Nutzungsbestimmungen in den Metadaten aller im Service angebotenen Datensätze. Bei der Nutzung des Dienstes verarbeitet der Anbieter des Dienstes die Daten des Beraters. Diese Informationen über die Protokollierung und Speicherung der Daten des Nutzers durch den Anbieter muss der Anbieter dem Berater immer im Voraus mitteilen. @de
title: The service can be used by anyone. The provider of the service gives no guarantees with regard to the operation of the service, nor with regard to the accuracy of the information offered. By using the service, each user or consultant undertakes to comply with the access and use provisions of the data provided in the service. Please refer to the access and usage provisions in the metadata of all datasets offered in the service. When using the service, the provider of the service processes the data of the consultant. This information regarding the logging and storage of the user's data by the provider must always be communicated by the provider to the consultant in advance. @en

Stadsbos - toestand 2019
type: Dataset
description: La couche de géodonnées «forêt urbaine» contient tous les groupes d’espaces verts accessibles au public d’une superficie minimale de 60 ha. Cette couche de géodonnées a été obtenue en sélectionnant toutes les «zones vertes» sur la base de la carte de l’utilisation des terres (état 2019). Ces espaces verts ont été regroupés algorithmiquement sur la base de la contiguïté, en tenant également compte des barrières physiques. Par la suite, seuls les espaces verts adjacents à une voie publique accessible à pied ont été conservés. Sur cette base, cinq couches de grille (résolution 10x10m2) ont été créées dans lesquelles des clusters ont été sélectionnés par niveau de fonction en fonction d'une surface minimale: verdure de quartier (>0,2ha); verdure de quartier (>10ha); vert de quartier (>30ha); vert urbain (>60ha); forêt urbaine (>200ha). Les clusters sélectionnés avec un niveau de fonction supérieur sont donc toujours un sous-ensemble des clusters sélectionnés d'un niveau de fonction inférieur. Veuillez noter qu’en raison de la méthode utilisée, le type vert «forêt urbaine» se compose non seulement de forêts, mais aussi de différents types d’espaces verts. De plus amples informations sont disponibles dans ce document de référence: https://archief.onderzoek.omgeving.vlaanderen.be/Onderzoek-2952295 La présence de verdure a un effet positif sur un certain nombre d’aspects différents qui déterminent un cadre de vie qualitatif. Cela inclut un effet positif sur la santé physique, mentale et sociale, mais aussi sur la biodiversité, la résilience climatique, la qualité du paysage,... Un cadre de référence flamand commun (introduit dans MIRA-S 2000) pour évaluer la disponibilité des espaces verts stipule que chaque résident devrait avoir accès à la verdure du quartier à un maximum de 400m, à la verdure du quartier à un maximum de 800m, à la verdure du quartier à un maximum de 1600m, à la verdure de la ville à un maximum de 3200m et à la forêt de la ville à un maximum de 5000m. Cet… @fr
subject: Vlaams Gewest
title: City forest - state 2019 @en
publisher: Departement Omgeving
accrual periodicity: onregelmatig
keyword: MercatorNet
description: De geodatalaag ‘stadsbos’ bevat alle clusters van publiek toegankelijke groene ruimte met een minimale oppervlakte van 60ha. Deze geodatalaag werd bekomen door het selectie van alle ‘groengebieden’ op basis van de landgebruikskaart (toestand 2019). Deze groengebieden werden algoritmisch geclusterd op basis van aaneengeslotenheid, waarbij ook fysieke barrières in rekening werden gebracht. Vervolgens werden enkel die groengebieden behouden die grenzen aan een te voet toegankelijke openbare weg. Op basis hiervan werden vijf rasterlagen (resolutie 10x10m²) opgemaakt waarbij clusters werden geselecteerd per functieniveau op basis van een minimale oppervlakte: buurtgroen (>0,2ha); wijkgroen (>10ha); stadsdeelgroen (>30ha); stadsgroen (>60ha); stadsbos (>200ha). De geselecteerde clusters met een hoger functieniveau zijn dus steeds een deelverzameling van de geselecteerde clusters van een lager functieniveau. Opgelet, door de toegepaste methode bestaat het groentype ‘stadsbos’ niet enkel uit bos, maar uit verschillende types groene ruimte. Meer informatie is terug te vinden in dit achtergronddocument: https://archief.onderzoek.omgeving.vlaanderen.be/Onderzoek-2952295 De aanwezigheid van groen heeft een positief effect op een heel aantal verschillende aspecten die een kwalitatieve leefomgeving bepalen. Het gaat hierbij o.a. om een positief effect op de fysieke, mentale en sociale gezondheid, maar ook om biodiversiteit, klimaatbestendigheid, landschappelijke kwaliteit,… Een gangbaar Vlaams referentiekader (geïntroduceerd in MIRA-S 2000) om de beschikbaarheid van groene ruimte te beoordelen stelt dat elke inwoner toegang zou moeten hebben tot buurtgroen op maximaal 400m, wijkgroen op maximaal 800m, stadsdeelgroen op maximaal 1600m, stadsgroen op maximaal 3200m en stadsbos op maximaal 5000m. Deze datalaag laat onder andere toe het aantal inwoners te berekenen in een bepaald gebied dat toegang heeft tot stadsbos rekening houdend met eerder vermelde maximale afstand.
representation technique: grid
title: Forêt urbaine - état 2019 @fr
access rights: openbaar
keyword: hh_stadsbos_2019
keyword: groentypologieën
conforms to: Belgian Lambert 72
description: The ‘urban forest’ geodata layer contains all clusters of publicly accessible green space with a minimum surface area of 60ha. This geodata layer was obtained by selecting all ‘green areas’ on the basis of the land use map (state 2019). These green areas were clustered algorithmically on the basis of contiguousness, also taking physical barriers into account. Subsequently, only those green areas adjacent to a public road accessible on foot were retained. Based on this, five grid layers (resolution 10x10m2) were created in which clusters were selected per function level based on a minimum surface area: neighbourhood greenery (>0,2ha); neighbourhood greenery (>10ha); district green (>30ha); urban green (>60ha); city forest (>200ha). The selected clusters with a higher function level are therefore always a subset of the selected clusters of a lower function level. Please note that, due to the method used, the green type ‘urban forest’ consists not only of forest, but of different types of green space. More information can be found in this background document: https://archief.onderzoek.omgeving.vlaanderen.be/Onderzoek-2952295 The presence of greenery has a positive effect on a number of different aspects that determine a qualitative living environment. This includes a positive effect on physical, mental and social health, but also on biodiversity, climate resilience, landscape quality,... A common Flemish frame of reference (introduced in MIRA-S 2000) to assess the availability of green space states that every resident should have access to neighborhood greenery at a maximum of 400m, neighborhood greenery at a maximum of 800m, district greenery at a maximum of 1600m, city greenery at a maximum of 3200m and city forest at a maximum of 5000m. This data layer allows, among other things, to calculate the number of inhabitants in a certain area that has access to city forest taking into account the previously mentioned maximum distance. @en
identifier: Identifier
  notation: https://metadata.omgeving.vlaanderen.be/srv/resources/datasets/MercatorNet-beba1f7302-cd77-402b-9392-19b9857f5f87
has quality measurement: QualityMeasurement
  value: 10
  unit measure: http://qudt.org/vocab/unit/M
  is measurement of: spatialResolutionAsDistance
landing page: https://www.vlaanderen.be/DataCatalogRecord/88998547-8f24-4fa5-a6fa-68aab0cfe66c
spatial: Flanders
description: Die Geodatenschicht „Stadtwald“ enthält alle Cluster öffentlich zugänglicher Grünflächen mit einer Mindestfläche von 60 ha. Diese Geodatenschicht wurde durch Auswahl aller „Grünflächen“ auf der Grundlage der Landnutzungskarte (Stand 2019) ermittelt. Diese Grünflächen wurden algorithmisch auf der Grundlage der Aneinanderreihung gruppiert, wobei auch physikalische Barrieren berücksichtigt wurden. In der Folge wurden nur die Grünflächen beibehalten, die an eine zu Fuß erreichbare öffentliche Straße angrenzen. Darauf aufbauend wurden fünf Rasterschichten (Auflösung 10x10m2) erstellt, in denen Cluster pro Funktionsstufe auf Basis einer Mindestfläche ausgewählt wurden: Nachbarschaftsgrün (>0,2ha); Nachbarschaftsgrün (> 10 ha); Bezirk grün (>30ha); städtisches Grün (> 60 ha); Stadtwald (>200ha). Die ausgewählten Cluster mit einer höheren Funktionsstufe sind daher immer eine Teilmenge der ausgewählten Cluster einer niedrigeren Funktionsstufe. Bitte beachten Sie, dass der grüne Typ „Stadtwald“ aufgrund der verwendeten Methode nicht nur aus Wald, sondern auch aus verschiedenen Arten von Grünflächen besteht. Weitere Informationen finden Sie in diesem Hintergrunddokument: https://archief.onderzoek.omgeving.vlaanderen.be/Onderzoek-2952295 Das Vorhandensein von Grün wirkt sich positiv auf eine Reihe verschiedener Aspekte aus, die ein qualitatives Lebensumfeld bestimmen. Ein gemeinsamer flämischer Bezugsrahmen (eingeführt in MIRA-S 2000), um die Verfügbarkeit von Grünflächen zu bewerten, besagt, dass jeder Bewohner Zugang zu Nachbarschaftsgrün in einem Maximum von 400m, Nachbarschaftsgrün in einem Maximum von 800m, Bezirksgrün in einem Maximum von 1600m, Stadtgrün in einem Maximum von 3200m und Stadtwald in einem Maximum von 5000m haben sollte. Diese Datenschicht ermöglicht es unter anderem, die Anzahl der Einwohner in einem bestimmten Gebiet, das Zugang zum Stadtwald hat, unter Berücksichtigung der zuvor genannten maximalen Entfernung zu berechnen. @de
rights holder: Departement Omgeving
keyword: OpenbareMetadata
issued: 2022-08-31
title: Stadtwald - Bundesland 2019 @de
spatial resolution in meters: 10
contact point: Kind
  fn: Vlaamse overheid, Departement Omgeving, Afdeling Beleid, Team Bodem
  fn: Vlaamse overheid, Departement Omgeving, Vlaams Planbureau voor Omgeving (VPO)
  has URL: https://omgeving.vlaanderen.be/nl/contact
  fn: Vlaams Planbureau voor Omgeving
  has URL: https://www.omgevingvlaanderen.be
theme: Regio's en steden
created: 2022-08-26
conforms to: ISO TC 211 GMD
subject: regional
language: Nederlands
theme: Gezondheid

Departement Omgeving
type: Organization
type: Regionaal bestuur
type: Agent

Regionaal bestuur
type: Concept
preferred label: Regional Authority @en
in scheme: http://purl.org/adms/publishertype/1.0

onregelmatig
type: Frequency
preferred label: irrégulier @fr
in scheme: frequency
preferred label: unregelmäßig @de
preferred label: irregular @en
type: Concept

openbaar
type: Concept
preferred label: public @fr
preferred label: without conditions @fr
in scheme: access-right
preferred label: Toegang zonder voorwaarden
type: RightsStatement
preferred label: öffentlich @de
preferred label: publiek
preferred label: publicly available @en
preferred label: Public @en

http://data.gov.be/.well-known/genid/prov/03dccab65307ed79a973c42cfb22b15086d1094f
type: ProvenanceStatement
title: Deze geodatalaag is het resultaat van het onderzoek 'groentypologieën 2019' uitgevoerd door de Vlaamse Instelling voor Technologisch Onderzoek in opdracht van het Departement Omgeving . De methodologie staat beschreven in het rapport https://archief.onderzoek.omgeving.vlaanderen.be/Onderzoek-2952295

Belgian Lambert 72
type: Standard
title: Belge 1972 / Belgian Lambert 72
type: SpatialReferenceSystem
title: EPSG:31370

hh:hh_stadsbos_2019
type: Distribution
availability: AVAILABLE
character encoding: UTF-8
license: Vlaamse Open Data licentie gratis hergebruik
access URL: https://metadata.vlaanderen.be/srv/dut/catalog.search#/metadata/88998547-8f24-4fa5-a6fa-68aab0cfe66c
conforms to: OGC:WMS-1.3.0-http-get-map
media type: application/xml
format: WMS
description: WMS-getmap Stadsbos - toestand 2019 (De accessURL verwijst naar een gelimiteerde set van data, volgens de INSPIRE afspraken)
identifier: Identifier
  notation: hh:hh_stadsbos_2019
download URL: https://www.mercator.vlaanderen.be/raadpleegdienstenmercatorpubliek/ows

Vlaamse Open Data licentie gratis hergebruik
type: LicenseDocument
type: Naamsvermelding

Naamsvermelding
type: Concept
preferred label: Attribution
in scheme: http://purl.org/adms/licencetype/1.0
notation: Attribution
type: LicenseDocument
preferred label: Verplichte bronvermelding

application/xml
type: Concept
in scheme: media-types
type: MediaType

WMS
type: MediaTypeOrExtent
in scheme: file-type
type: Concept

hh:hh_stadsbos_2019
type: Distribution
license: Vlaamse Open Data licentie gratis hergebruik
identifier: Identifier
  notation: hh:hh_stadsbos_2019
access URL: https://metadata.vlaanderen.be/srv/dut/catalog.search#/metadata/88998547-8f24-4fa5-a6fa-68aab0cfe66c
format: WCS
availability: AVAILABLE
download URL: https://www.mercator.vlaanderen.be/raadpleegdienstenmercatorpubliek/ows
character encoding: UTF-8
conforms to: OGC:WCS-2.0.0-http-get-coverage
media type: application/xml
description: WCS-getCoverage Stadsbos - toestand 2019 (De accessURL verwijst naar een gelimiteerde set van data, volgens de INSPIRE afspraken)

WCS
type: MediaTypeOrExtent
type: Concept
in scheme: file-type

thumbnail
type: Distribution
media type: application/xml
availability: AVAILABLE
download URL: https://www.mercator.vlaanderen.be/raadpleegdienstenmercatorpubliek/wms
format: WMS
access URL: https://metadata.vlaanderen.be/srv/dut/catalog.search#/metadata/88998547-8f24-4fa5-a6fa-68aab0cfe66c

Regio's en steden
type: Concept
preferred label: REGIONS, CITIES @en
in scheme: data-theme
preferred label: Regional @en
preferred label: Régions et villes @fr

hh:hh_stadsbos_2019
type: Distribution
access URL: https://metadata.vlaanderen.be/srv/dut/catalog.search#/metadata/88998547-8f24-4fa5-a6fa-68aab0cfe66c
conforms to: WWW:DOWNLOAD-1.0-http--download
description: Stadsbos - toestand 2019
rights: https://codex.vlaanderen.be/PrintDocument.ashx
license: Vlaamse Open Data licentie gratis hergebruik
character encoding: UTF-8
availability: AVAILABLE
format: GeoTIFF
download URL: https://datasets.omgeving.vlaanderen.be/be.vlaanderen.omgeving.distribution.geo.ba1f7302-cd77-402b-9392-19b9857f5f87.hh_stadsbos_2019_zip

https://codex.vlaanderen.be/PrintDocument.ashx
type: RightsStatement
title: Der Zugang und die Nutzung für die Wahrnehmung von Aufgaben von allgemeinem Interesse durch nichtflämische Behörden wird durch das Dekret der flämischen Regierung mit den Regeln für den Zugang und die Nutzung geografischer Datenquellen geregelt, die dem GDI von Behörden hinzugefügt werden, die nicht an GDI-Flandern teilnehmen. Diese Nutzung ist kostenlos. @de
title: L’accès et l’utilisation pour l’exécution de tâches d’intérêt général par des autorités publiques non flamandes sont régis par le décret du gouvernement flamand, les règles d’accès et d’utilisation des sources de données géographiques étant ajoutées au GDI, par des autorités publiques qui ne participent pas au GDI-Flandre. Cette utilisation est gratuite. @fr
title: Toegang en gebruik voor het uitvoeren van taken van algemeen belang door niet-Vlaamse overheidsinstanties is geregeld door het Besluit van de Vlaamse Regering met de regels voor toegang en gebruik van geografische gegevensbronnen toegevoegd aan de GDI, door overheidsdiensten die geen deelnemer zijn aan GDI-Vlaanderen. Dit gebruik is kosteloos.
title: Access and use for the performance of tasks of general interest by non-Flemish public authorities is regulated by the Decree of the Flemish Government with the rules for access and use of geographical data sources added to the GDI, by public authorities that are not participants in GDI-Flanders. This use is free of charge. @en

https://codex.vlaanderen.be/PrintDocument.ashx
type: RightsStatement
title: Toegang en gebruik voor het uitvoeren van taken van algemeen belang, op niveau van Vlaamse overheidsinstanties is geregeld door het Besluit van de Vlaamse Regering met de regels voor toegang en gebruik van geografische gegevensbronnen toegevoegd aan de GDI, door deelnemers GDI-Vlaanderen. Dit gebruik is kosteloos.
title: Accès et utilisation pour l'exécution de tâches d'intérêt général, au niveau flamand les autorités publiques sont régies par le décret du gouvernement flamand avec les règles pour l'accès et l'utilisation des sources de données géographiques ajoutées à l'IDG, par participants GDI-Flandre. Cette utilisation est gratuite. @fr
title: Toegang en gebruik voor het uitvoeren van taken van algemeen belang, op niveau van Vlaamseoverheidsinstanties is geregeld door het Besluit van de Vlaamse Regering met de regels voor toegang en gebruik van geografische gegevensbronnen toegevoegd aan de GDI, door deelnemers GDI-Vlaanderen. Dit gebruik is kosteloos.
title: Zugang und Verwendung zur Erfüllung von Aufgaben von allgemeinem Interesse auf flämischer Ebene Behörden werden durch das Dekret der flämischen Regierung mit den Regeln geregelt für Zugang zu und Nutzung geografischer Datenquellen, die der GDI hinzugefügt wurden, durch Teilnehmer GDI-Flandern. Diese Nutzung ist kostenlos. @de
title: Access and use for the performance of tasks of general interest, at Flemish level public authorities is regulated by the Decree of the Flemish Government with the rules for access and use of geographical data sources added to the GDI, by participants GDI-Flanders. This use is free of charge. @en

GeoTIFF
type: MediaTypeOrExtent
in scheme: file-type
type: Concept

ISO TC 211 GMD
type: Standard

Nederlands
type: LinguisticSystem
preferred label: Dutch @en
preferred label: Niederländisch @de
in scheme: language
preferred label: Néerlandais @fr
preferred label: néerlandais @fr
type: Concept

Gezondheid
type: Concept
preferred label: HEALTH @en
preferred label: Santé @fr
preferred label: Health @en
in scheme: data-theme

Technical Guidance for the implementation of INSPIRE Discovery Services
type: Standard
title: Technical Guidance for the implementation of INSPIRE View Services @en