Belgian Transport Emissions from 1990
type: Dataset
transport mode: air
description: Συγκειμενικό σύνολο δεδομένων σχετικά με τις εκπομπές από τις βελγικές μεταφορές από το 1990: - Γεωγραφικό όριο: Εθνική (Βέλγιο) - Έτος(-η): 1990 έως το έτος X-2 (ετήσια επικαιροποίηση όλων των ετών από το 1990) - Κατηγορίες: μέσα μεταφοράς (εσωτερική αεροπορία, διεθνής αεροπορία, οδικές μεταφορές (αυτοκίνητα, ελαφρά επαγγελματικά οχήματα, βαρέα επαγγελματικά οχήματα, μοτοσικλέτες, άλλα), σιδηρόδρομοι, εσωτερικές πλωτές οδοί, διεθνής ναυτιλία, άλλες μεταφορές, μεταφορές μέσω αγωγών, άλλα). - Μεταβλητές και μονάδες: εκπομπές αερίων του θερμοκηπίου (συγκεντρωτικές ή CO2, CH4, N2O, CO, NOx, SO2, NMVOC) σε kt ή ktCO2eq, κατανάλωση καυσίμου σε TJ, τεκμαρτοί συντελεστές εκπομπών (βάρος των αερίων του θερμοκηπίου που εκπέμπονται ανά ενεργειακό περιεχόμενο καυσίμου) ανά τύπο αερίου και τύπο καυσίμου σε t/TJ ή kg/TJ. Σύνδεσμοι: * Υποβολή της βελγικής απογραφής αερίων του θερμοκηπίου της ΕΕ – από το 2024 και μετά (Ιανουάριος και Μάρτιος κάθε έτους): https://cdr.eionet.europa.eu/be/eu/govreg/inventory/ * Υποβολή της βελγικής απογραφής αερίων του θερμοκηπίου της ΕΕ – έως το 2023 (ετησίως, από το 2015 και μετά, τον Ιανουάριο και τον Μάρτιο κάθε έτους): https://cdr.eionet.europa.eu/ReportekEngine/searchdataflow?dataflow_uris=http%3A%2F%2Frod.eionet.europa.eu%2Fobligations%2F701&years%3Aint%3Aignore_empty=&partofyear=&reportingdate_start%3Adate%3Aignore_empty=&reportingdate_end%3Adate%3Aignore_empty=&country=http%3A%2F%2Frod.eionet.europa.eu%2Fspatial%2F5&release_status=anystatus&sort_on=reportingdate&sort_order=reverse&batch_size Υποβολή της βελγικής απογραφής αερίων του θερμοκηπίου στο πλαίσιο της UNFCCC (ετήσια, από το 2003, Μάιος κάθε έτους): https://unfccc.int/ghg-inventories-annex-i-parties/2023 * Απεικόνιση δεδομένων αερίων του θερμοκηπίου εντός του ΕΟΧ της ΕΕ: https://www.eea.europa.eu/data-and-maps/data/data-viewers/greenhouse-gases-viewer * Πύλη δεδομένων απογραφής αερίων θερμοκηπίου της UNFCCC (https://di.unfccc.int/): ευέλικτο ερώτημα (https://di.unfccc.int/flex_annex1… @el
title: Belgische Verkehrsemissionen ab 1990 @sl
publisher: Belgian Climate Centre
description: Ensemble de données contextuelles sur les émissions des transports belges depuis 1990 : - Limite géographique : nationale (Belgique) - Année(s) : de 1990 à l'année X-2 (mise à jour annuelle de toutes les années à partir de 1990) - Catégories : modes de transport (aviation intérieure, aviation internationale, transport routier [voitures, véhicules utilitaires légers, véhicules utilitaires lourds, motocycles, autres], chemins de fer, navigation intérieure, navigation internationale, autres transports, transport par conduites, autres]. - Variables et unités : émissions de gaz à effet de serre (agrégées ou CO2, CH4, N2O, CO, NOx, SO2, NMVOC) en kt ou ktCO2eq, consommation de carburant en TJ, facteurs d'émission implicites (poids des gaz à effet de serre émis par contenu énergétique du carburant) par type de gaz et par type de carburant en t/TJ ou kg/TJ. Links: * Belgian EU GHG inventory submission – from 2024 onwards (January and March of each year): https://cdr.eionet.europa.eu/be/eu/govreg/inventory/ * Belgian EU GHG inventory submission – until 2023 (yearly, from 2015 onwards, January and March of each year): https://cdr.eionet.europa.eu/ReportekEngine/searchdataflow?dataflow_uris=http%3A%2F%2Frod.eionet.europa.eu%2Fobligations%2F701&years%3Aint%3Aignore_empty=&partofyear=&reportingdate_start%3Adate%3Aignore_empty=&reportingdate_end%3Adate%3Aignore_empty=&country=http%3A%2F%2Frod.eionet.europa.eu%2Fspatial%2F5&release_status=anystatus&sort_on=reportingdate&sort_order=reverse&batch_size * Belgian UNFCCC GHG inventory submission (yearly, from 2003, May of each year): https://unfccc.int/ghg-inventories-annex-i-parties/2023 * EU EEA greenhouse gas data viewer: https://www.eea.europa.eu/data-and-maps/data/data-viewers/greenhouse-gases-viewer * UNFCCC Greenhouse Gas Inventory Data portal (https://di.unfccc.int/): flexible query (https://di.unfccc.int/flex_annex1). * National climate Commission (yearly, from 2014, January, March and May of each year): Reports | National Cli… @fr
transport mode: regional-and-local-rail
transport mode: bus
description: Kontekstuelt datasæt om emissioner fra belgisk transport siden 1990: Geografisk afgrænsning: National (Belgien) - År: 1990 til år X-2 (årlig ajourføring af alle år fra 1990) Kategorier: transportformer (indenlandsk luftfart, international luftfart, vejtransport (biler, lette erhvervskøretøjer, tunge erhvervskøretøjer, motorcykler, andet), jernbaner, indre vandveje, international skibsfart, anden transport, rørledningstransport, andet). Variabler og enheder: drivhusgasemissioner (aggregerede eller CO2, CH4, N2O, CO, NOx, SO2, NMVOC) i kt eller ktCO2eq, brændstofforbrug i TJ, implicitte emissionsfaktorer (vægten af drivhusgasser udledt pr. brændstofenergiindhold) efter gastype og brændstoftype i t/TJ eller kg/TJ. Links: * Indsendelse af den belgiske EU-drivhusgasopgørelse – fra 2024 og fremefter (januar og marts hvert år): https://cdr.eionet.europa.eu/be/eu/govreg/inventory/ * Indsendelse af den belgiske EU-drivhusgasopgørelse – indtil 2023 (årligt, fra 2015 og frem, januar og marts hvert år): https://cdr.eionet.europa.eu/ReportekEngine/searchdataflow?dataflow_uris=http%3A%2F%2Frod.eionet.europa.eu%2Fobligations%2F701&years%3Aint%3Aignore_empty=&partofyear=&reportingdate_start%3Adate%3Aignore_empty=&reportingdate_end%3Adate%3Aignore_empty=&country=http%3A%2F%2Frod.eionet.europa.eu%2Fspatial%2F5&release_status=anystatus&sort_on=reportingdate&sort_order=reverse&batch_size Indsendelse af den belgiske UNFCCC-drivhusgasopgørelse (årligt fra 2003, maj hvert år): https://unfccc.int/ghg-inventories-annex-i-parties/2023 * EU EEA drivhusgas data viewer: https://www.eea.europa.eu/data-and-maps/data/data-viewers/greenhouse-gases-viewer * UNFCCC's portal for data om drivhusgasopgørelser (https://di.unfccc.int/): fleksibel forespørgsel (https://di.unfccc.int/flex_annex1). * Den nationale klimakommission (årligt, fra 2014, januar, marts og maj hvert år): Rapporter | National Climate Commission (cnc-nkc.be) https://www.cnc-nkc.be/en/reports > drivhusgasopgørelse (se den seneste indse… @da
mobility theme: freight-and-logistics
description: Serie di dati contestuali sulle emissioni dei trasporti belgi dal 1990: - Confine geografico: Nazionale (Belgio) - Anno/i: 1990 all'anno X-2 (aggiornamento annuale di tutti gli anni dal 1990) - Categorie: modi di trasporto (aviazione nazionale, aviazione internazionale, trasporto su strada (automobili, veicoli commerciali leggeri, veicoli commerciali pesanti, motocicli, altro), ferrovie, vie navigabili interne, trasporto marittimo internazionale, altri trasporti, trasporto mediante condotte, altro). - Variabili e unità: emissioni di gas a effetto serra (aggregate o CO2, CH4, N2O, CO, NOx, SO2, NMVOC) in kt o ktCO2eq, consumo di carburante in TJ, fattori impliciti di emissione (peso dei gas a effetto serra emessi per contenuto energetico del carburante) per tipo di gas e tipo di carburante in t/TJ o kg/TJ. Collegamenti: * Presentazione dell'inventario belga dei gas a effetto serra dell'UE – a partire dal 2024 (gennaio e marzo di ogni anno): https://cdr.eionet.europa.eu/be/eu/govreg/inventory/ * Presentazione dell'inventario belga dei gas a effetto serra dell'UE – fino al 2023 (annuale, a partire dal 2015, gennaio e marzo di ogni anno): https://cdr.eionet.europa.eu/ReportekEngine/searchdataflow?dataflow_uris=http%3A%2F%2Frod.eionet.europa.eu%2Fobligations%2F701&years%3Aint%3Aignore_empty=&partofyear=&reportingdate_start%3Adate%3Aignore_empty=&reportingdate_end%3Adate%3Aignore_empty=&country=http%3A%2F%2Frod.eionet.europa.eu%2Fspatial%2F5&release_status=anystatus&sort_on=reportingdate&sort_order=reverse&batch_size Presentazione dell'inventario belga dei gas a effetto serra dell'UNFCCC (annuale, a partire dal 2003, maggio di ogni anno): https://unfccc.int/ghg-inventories-annex-i-parties/2023 * visualizzatore di dati sui gas a effetto serra dell'AEA dell'UE: https://www.eea.europa.eu/data-and-maps/data/data-viewers/greenhouse-gases-viewer * Portale dei dati dell'inventario dei gas a effetto serra dell'UNFCCC (https://di.unfccc.int/): query flessibile (https://di.unfccc.i… @it
description: Набор от контекстуални данни за емисиите от белгийския транспорт от 1990 г. насам: - Географска граница: Национално (Белгия) - Година(и): 1990 г. до година X-2 (годишна актуализация на всички години от 1990 г.) - Категории: видове транспорт (вътрешно въздухоплаване, международно въздухоплаване, автомобилен транспорт (автомобили, леки търговски превозни средства, тежкотоварни търговски превозни средства, мотоциклети, други), железопътни линии, вътрешни водни пътища, международно корабоплаване, друг транспорт, тръбопроводен транспорт, други). Променливи и мерни единици: емисии на парникови газове (обобщени или CO2, CH4, N2O, CO, NOx, SO2, НМЛОС) в kt или ktCO2eq, разход на гориво в TJ, имплицитни емисионни фактори (тегло на емисиите на парникови газове по енергийно съдържание на горивото) по вид газ и вид гориво в t/TJ или kg/TJ. Връзки: * Представяне от Белгия на инвентаризацията на парниковите газове в ЕС — от 2024 г. нататък (януари и март всяка година): https://cdr.eionet.europa.eu/be/eu/govreg/inventory/ * Представяне от Белгия на инвентаризацията на парниковите газове в ЕС — до 2023 г. (годишно, от 2015 г. нататък, през януари и март всяка година): https://cdr.eionet.europa.eu/ReportekEngine/searchdataflow?dataflow_uris=http%3A%2F%2Frod.eionet.europa.eu%2Fobligations%2F701&years%3Aint%3Aignore_empty=&partofyear=&reportingdate_start%3Adate%3Aignore_empty=&reportingdate_end%3Adate%3Aignore_empty=&country=http%3A%2F%2Frod.eionet.europa.eu%2Fspatial%2F5&release_status=anystatus&sort_on=reportingdate&sort_order=reverse&batch_size Представяне от Белгия на инвентаризацията на парниковите газове по РКООНИК (годишно, от 2003 г., май всяка година): https://unfccc.int/ghg-inventories-annex-i-parties/2023 * Преглед на данни за парниковите газове в ЕАОС: https://www.eea.europa.eu/data-and-maps/data/data-viewers/greenhouse-gases-viewer * Портал за данни за инвентаризацията на парниковите газове по РКООНИК (https://di.unfccc.int/): гъвкава заявка (https://di.unfccc.int/flex_an… @bg
language: English
title: Belgische Verkehrsemissionen 1990 óta @hu
mobility theme: other
title: Belgische vervoersemissies vanaf 1990 @nl
description: Conjunto de dados contextuais sobre as emissões provenientes do transporte belga desde 1990: Limite geográfico: Nacional (Bélgica) Ano(s): 1990 ao ano X-2 (actualização anual de todos os anos a partir de 1990) - Categorias: modos de transporte (aviação interna, aviação internacional, transporte rodoviário (automóveis, veículos comerciais ligeiros, veículos comerciais pesados, motociclos, outros), caminhos de ferro, vias navegáveis interiores, transporte marítimo internacional, outros transportes, transporte por condutas, outros). - Variáveis e unidades: Emissões de gases com efeito de estufa (agregadas ou CO2, CH4, N2O, CO, NOx, SO2, COVNM) em kt ou ktCO2eq, consumo de combustível em TJ, fatores de emissão implícitos (peso dos gases com efeito de estufa emitidos por teor energético de combustível) por tipo de gás e tipo de combustível em t/TJ ou kg/TJ. Ligações: * Apresentação do inventário belga de GEE da UE – a partir de 2024 (janeiro e março de cada ano): https://cdr.eionet.europa.eu/be/eu/govreg/inventory/ * Apresentação do inventário belga de GEE da UE – até 2023 (anualmente, a partir de 2015, janeiro e março de cada ano): https://cdr.eionet.europa.eu/ReportekEngine/searchdataflow?dataflow_uris=http%3A%2F%2Frod.eionet.europa.eu%2Fobligations%2F701&years%3Aint%3Aignore_empty=&partofyear=&reportingdate_start%3Adate%3Aignore_empty=&reportingdate_end%3Adate%3Aignore_empty=&country=http%3A%2F%2Frod.eionet.europa.eu%2Fspatial%2F5&release_status=anystatus&sort_on=reportingdate&sort_order=reverse&batch_size Apresentação do inventário belga de GEE da CQNUAC (anualmente, a partir de 2003, maio de cada ano): https://unfccc.int/ghg-inventories-annex-i-parties/2023 * Visualizador de dados sobre gases com efeito de estufa na AEA da UE: https://www.eea.europa.eu/data-and-maps/data/data-viewers/greenhouse-gases-viewer * Portal de dados do inventário de gases com efeito de estufa da CQNUAC (https://di.unfccc.int/): consulta flexível (https://di.unfccc.int/flex_annex1). * Comiss… @pt
accrual periodicity: annual
transport mode: car
transport mode: metro-subway-train
transport mode: car-hire
transport mode: taxi
transport mode: shuttle-bus
description: A belga közlekedésből származó kibocsátásokra vonatkozó háttér-adatkészlet 1990 óta: Földrajzi határvonal: Nemzeti (Belgium) Év(ek): 1990-től az X-2. évig (az 1990-től számított valamennyi év éves aktualizálása) Kategóriák: szállítási módok (belföldi légi közlekedés, nemzetközi légi közlekedés, közúti szállítás (személygépkocsik, könnyű haszongépjárművek, nehéz haszongépjárművek, motorkerékpárok, egyéb), vasutak, belvízi utak, nemzetközi hajózás, egyéb szállítás, csővezetékes szállítás, egyéb). Változók és mértékegységek: üvegházhatásúgáz-kibocsátás (összesített vagy CO2, CH4, N2O, CO, NOx, SO2, NMVOC) kt vagy kt CO2eq-ben, tüzelőanyag-fogyasztás TJ-ban, implicit kibocsátási tényezők (a kibocsátott üvegházhatású gázok tömege tüzelőanyag-energiatartalomonként) gáztípusonként és tüzelőanyag-típusonként t/TJ-ban vagy kg/TJ-ban. Linkek: * Belgium ÜHG-jegyzékének benyújtása – 2024-től kezdődően (minden év januárjában és márciusában): https://cdr.eionet.europa.eu/be/eu/govreg/inventory/ * Belgium ÜHG-jegyzékének benyújtása – 2023-ig (évente, 2015-től kezdődően, minden év januárjában és márciusában): https://cdr.eionet.europa.eu/ReportekEngine/searchdataflow?dataflow_uris=http%3A%2F%2Frod.eionet.europa.eu%2Fobligations%2F701&years%3Aint%3Aignore_empty=&partofyear=&reportingdate_start%3Adate%3Aignore_empty=&reportingdate_end%3Adate%3Aignore_empty=&country=http%3A%2F%2Frod.eionet.europa.eu%2Fspatial%2F5&release_status=anystatus&sort_on=reportingdate&sort_order=reverse&batch_size Az UNFCCC belga ÜHG-jegyzékének benyújtása (évente, 2003-tól minden év májusáig): https://unfccc.int/ghg-inventories-annex-i-parties/2023 * Az EU-EGT üvegházhatásúgáz-adatmegjelenítője: https://www.eea.europa.eu/data-and-maps/data/data-viewers/greenhouse-gases-viewer * UNFCCC üvegházhatású gázok jegyzékének adatportálja (https://di.unfccc.int/): rugalmas lekérdezés (https://di.unfccc.int/flex_annex1). * Nemzeti Éghajlati Bizottság (évente, 2014-től, minden év januárjától, márciusától és májusától): J… @hu
title: Émissions belges des transports à partir de 1990 @fr
transport mode: truck
description: Tacar sonraí comhthéacsúla maidir le hastaíochtaí ó iompar na Beilge ó bhí 1990 ann: - Teorainn gheografach: Náisiúnta (an Bheilg) - Bliain/Blianta: 1990 go bliain X-2 (nuashonrú bliantúil ar gach bliain ó 1990) - Catagóirí: modhanna iompair (eitlíocht intíre, eitlíocht idirnáisiúnta, iompar de bhóthar (gluaisteáin, feithiclí tráchtála éadroma, feithiclí tráchtála troma, gluaisrothair, eile), iarnróid, uiscebhealaí intíre, loingseoireacht idirnáisiúnta, iompar eile, iompar trí phíblíne, eile). - Athróga agus aonaid: astaíochtaí gás ceaptha teasa (comhiomlánaithe nó CO2, CH4, N2O, CO, NOx, SO2, NMVOC) in kt nó ktCO2eq, ídiú breosla in TJ, fachtóirí astaíochta intuigthe (meáchan na ngás ceaptha teasa a astaítear in aghaidh an chion fuinnimh breosla) de réir an chineáil gáis agus an chineáil breosla in t/TJ nó kg/TJ. Naisc: * Cur isteach fhardal GCT na Beilge san Aontas – ó 2024 ar aghaidh (Eanáir agus Márta gach bliain): https://cdr.eionet.europa.eu/be/eu/govreg/inventory/ * Cur isteach fhardal GCT na Beilge san Aontas – go dtí 2023 (in aghaidh na bliana, ó 2015 ar aghaidh, ó mhí Eanáir agus ó mhí an Mhárta gach bliain): https://cdr.eionet.europa.eu/ReportekEngine/searchdataflow?dataflow_uris=http%3A%2F%2Frod.eionet.europa.eu%2Fobligations%2F701&years%3Aint%3Aignore_empty=&partofyear=&reportingdate_start%3Adate%3Aignore_empty=&reportingdate_end%3Adate%3Aignore_empty=&country=http%3A%2F%2Frod.eionet.europa.eu%2Fspatial%2F5&release_status=anystatus&sort_on=reportingdate&sort_order=reverse&batch_size Cur isteach fhardal GCT UNFCCC na Beilge (in aghaidh na bliana, ó 2003, Bealtaine gach bliain): https://unfccc.int/ghg-inventories-annex-i-parties/2023 * Breathnóir sonraí gás ceaptha teasa EEA AE: https://www.eea.europa.eu/data-and-maps/data/data-viewers/greenhouse-gases-viewer * Tairseach Sonraí Fhardal Gás Ceaptha Teasa UNFCCC (https://di.unfccc.int/): ceist sholúbtha (https://di.unfccc.int/flex_annex1). * An Coimisiún Náisiúnta Aeráide (bliantúil, ó 2014, Eanáir, Márta a… @ga
description: Dataset met contextuele gegevens over Belgische transportemissies vanaf 1990: - Geografische begrenzing: nationaal (België) - Jaar/jaren: 1990 tot jaar X-2 (jaarlijkse update van alle jaren vanaf 1990) - Categorieën: vervoerswijzen (binnenlandse luchtvaart, internationale luchtvaart, wegvervoer [auto's, lichte vrachtwagens, zware vrachtwagens, motorfietsen, overige], spoorwegen, binnenlandse scheepvaart, internationale scheepvaart, overig vervoer, vervoer via pijpleidingen, overige]. - Variabelen en eenheden: emissie van broeikasgassen (geaggregeerd of CO2, CH4, N2O, CO, NOx, SO2, NMVOC) in kt of ktCO2eq, brandstofverbruik in TJ, impliciete emissiefactoren (gewicht van uitgestoten broeikasgassen per energie-inhoud van brandstof) per type gas en per type brandstof in t/TJ of kg/TJ. Links: * Belgian EU GHG inventory submission – from 2024 onwards (January and March of each year): https://cdr.eionet.europa.eu/be/eu/govreg/inventory/ * Belgian EU GHG inventory submission – until 2023 (yearly, from 2015 onwards, January and March of each year): https://cdr.eionet.europa.eu/ReportekEngine/searchdataflow?dataflow_uris=http%3A%2F%2Frod.eionet.europa.eu%2Fobligations%2F701&years%3Aint%3Aignore_empty=&partofyear=&reportingdate_start%3Adate%3Aignore_empty=&reportingdate_end%3Adate%3Aignore_empty=&country=http%3A%2F%2Frod.eionet.europa.eu%2Fspatial%2F5&release_status=anystatus&sort_on=reportingdate&sort_order=reverse&batch_size * Belgian UNFCCC GHG inventory submission (yearly, from 2003, May of each year): https://unfccc.int/ghg-inventories-annex-i-parties/2023 * EU EEA greenhouse gas data viewer: https://www.eea.europa.eu/data-and-maps/data/data-viewers/greenhouse-gases-viewer * UNFCCC Greenhouse Gas Inventory Data portal (https://di.unfccc.int/): flexible query (https://di.unfccc.int/flex_annex1). * National climate Commission (yearly, from 2014, January, March and May of each year): Reports | National Climate Commission (cnc-nkc.be) https://www.cnc-nkc.be/en/reports > GHG i… @nl
description: Set de date contextuale privind emisiile generate de transportul belgian începând din 1990: Limita geografică: Național (Belgia) - Anul (anii): 1990 până în anul X-2 (actualizarea anuală a tuturor anilor începând cu 1990) Categorii: modurile de transport [aviația internă, aviația internațională, transportul rutier (autoturisme, vehicule utilitare ușoare, vehicule utilitare grele, motociclete, altele), căile ferate, căile navigabile interioare, transportul maritim internațional, alte tipuri de transport, transportul prin conducte, altele]. Variabile și unități: emisiile de gaze cu efect de seră (agregate sau CO2, CH4, N2O, CO, NOx, SO2, COVnm) în kt sau ktCO2eq, consumul de combustibil în TJ, factorii de emisie impliciți (greutatea gazelor cu efect de seră emise per conținut energetic al combustibilului) pe tip de gaz și tip de combustibil în t/TJ sau kg/TJ. Link-uri: * Transmiterea inventarului belgian al GES în UE – începând cu 2024 (ianuarie și martie ale fiecărui an): https://cdr.eionet.europa.eu/be/eu/govreg/inventory/ * Transmiterea inventarului belgian al GES în UE – până în 2023 (anual, începând cu 2015, în lunile ianuarie și martie ale fiecărui an): https://cdr.eionet.europa.eu/ReportekEngine/searchdataflow?dataflow_uris=http%3A%2F%2Frod.eionet.europa.eu%2Fobligations%2F701&years%3Aint%3Aignore_empty=&partofyear=&reportingdate_start%3Adate%3Aignore_empty=&reportingdate_end%3Adate%3Aignore_empty=&country=http%3A%2F%2Frod.eionet.europa.eu%2Fspatial%2F5&release_status=anystatus&sort_on=reportingdate&sort_order=reverse&batch_size Transmiterea inventarului GES de către Belgia în cadrul CCONUSC (anual, începând cu 2003, în luna mai a fiecărui an): https://unfccc.int/ghg-inventories-annex-i-parties/2023 * Vizualizator de date privind gazele cu efect de seră din UE și SEE: https://www.eea.europa.eu/data-and-maps/data/data-viewers/greenhouse-gases-viewer * Portalul de date privind inventarul gazelor cu efect de seră al CCONUSC (https://di.unfccc.int/): interogare fle… @ro
transport mode: car-pooling
description: Sett ta’ data kuntestwali dwar l-emissjonijiet mit-trasport Belġjan mill-1990: - Il-limitu ġeografiku: Nazzjonali (il-Belġju) - Sena/snin: 1990 sas-sena X-2 (aġġornament annwali tas-snin kollha mill-1990) - Kategoriji: modi ta’ trasport (avjazzjoni domestika, avjazzjoni internazzjonali, trasport bit-triq (karozzi, vetturi kummerċjali ħfief, vetturi kummerċjali tqal, muturi, oħrajn), ferroviji, passaġġi fuq l-ilma interni, trasport marittimu internazzjonali, trasport ieħor, trasport bil-pipelines, oħrajn). - Varjabbli u unitajiet: l-emissjonijiet ta’ gassijiet serra (aggregati jew CO2, CH4, N2O, CO, NOx, SO2, NMVOC) f’kt jew ktCO2eq, il-konsum tal-fjuwil f’TJ, il-fatturi ta’ emissjoni impliċiti (il-piż tal-gassijiet serra emessi għal kull kontenut ta’ enerġija tal-fjuwil) skont it-tip ta’ gass u t-tip ta’ fjuwil f’t/TJ jew kg/TJ. Links: * Sottomissjoni Belġjana tal-inventarju tal-gassijiet serra tal-UE – mill-2024 ’il quddiem (Jannar u Marzu ta’ kull sena): https://cdr.eionet.europa.eu/be/eu/govreg/inventory/ * Sottomissjoni Belġjana tal-inventarju tal-gassijiet serra tal-UE – sal-2023 (kull sena, mill-2015 ’il quddiem, Jannar u Marzu ta’ kull sena): https://cdr.eionet.europa.eu/ReportekEngine/searchdataflow?dataflow_uris=http%3A%2F%2Frod.eionet.europa.eu%2Fobligations%2F701&years%3Aint%3Aignore_empty=&partofyear=&reportingdate_start%3Adate%3Aignore_empty=&reportingdate_end%3Adate%3Aignore_empty=&country=http%3A%2F%2Frod.eionet.europa.eu%2Fspatial%2F5&release_status=anystatus&sort_on=reportingdate&sort_order=reverse&batch_size Sottomissjoni Belġjana tal-inventarju tal-GHG tal-UNFCCC (kull sena, mill-2003, Mejju ta’ kull sena): https://unfccc.int/ghg-inventories-annex-i-parties/2023 * Viżwalizzatur tad-data tal-UE dwar il-gassijiet serra tal-EEA: https://www.eea.europa.eu/data-and-maps/data/data-viewers/greenhouse-gases-viewer * Il-portal tad-Data tal-Inventarju tal-Gassijiet Serra tal-UNFCCC (https://di.unfccc.int/): mistoqsija flessibbli (https://di.unfccc.int/flex_… @mt
applicable legislation: oj
transport mode: long-distance-rail
title: Belgia Verkehrsemissionen ab 1990 @fi
transport mode: car-sharing
transport mode: motorcycle
description: Dataset with contextual data on Belgian transport emissions from 1990: - Geographical boundary: national (Belgium) - Year(s): 1990 to year X-2 (yearly update of all years from 1990 onwards) - Categories: transport modes (domestic aviation, international aviation, road transportation [cars, light duty trucks, heavy duty trucks, motorcycles, other], railways, domestic navigation, international navigation, other transportation, pipeline transport, other] - Variables and units: emission of GHG gases (aggregated or CO2, CH4, N2O, CO, NOx, SO2, NMVOC) in kt or ktCO2eq, fuel consumption in TJ, implied emission factors (weight of GHG emitted per energy content of fuel) per type of gas and per type of fuel in t/TJ or kg/TJ. Links: * Belgian EU GHG inventory submission – from 2024 onwards (January and March of each year): https://cdr.eionet.europa.eu/be/eu/govreg/inventory/ * Belgian EU GHG inventory submission – until 2023 (yearly, from 2015 onwards, January and March of each year): https://cdr.eionet.europa.eu/ReportekEngine/searchdataflow?dataflow_uris=http%3A%2F%2Frod.eionet.europa.eu%2Fobligations%2F701&years%3Aint%3Aignore_empty=&partofyear=&reportingdate_start%3Adate%3Aignore_empty=&reportingdate_end%3Adate%3Aignore_empty=&country=http%3A%2F%2Frod.eionet.europa.eu%2Fspatial%2F5&release_status=anystatus&sort_on=reportingdate&sort_order=reverse&batch_size * Belgian UNFCCC GHG inventory submission (yearly, from 2003, May of each year): https://unfccc.int/ghg-inventories-annex-i-parties/2023 * EU EEA greenhouse gas data viewer: https://www.eea.europa.eu/data-and-maps/data/data-viewers/greenhouse-gases-viewer * UNFCCC Greenhouse Gas Inventory Data portal (https://di.unfccc.int/): flexible query (https://di.unfccc.int/flex_annex1). * National climate Commission (yearly, from 2014, January, March and May of each year): Reports | National Climate Commission (cnc-nkc.be) https://www.cnc-nkc.be/en/reports > GHG inventory (see most recent dataset submission for more details, only…
description: Kontekstuāla datu kopa par Beļģijas transporta radītajām emisijām kopš 1990. gada: Ģeogrāfiskā robeža: National (Beļģija) - Gads(-i): no 1990. gada līdz X-2 gadam (ikgadējais atjauninājums par visiem gadiem, sākot no 1990. gada) Kategorijas: transporta veidi (iekšzemes aviācija, starptautiskā aviācija, autotransports (automobiļi, vieglie komerciālie transportlīdzekļi, smagie komerciālie transportlīdzekļi, motocikli, citi), dzelzceļš, iekšzemes ūdensceļi, starptautiskā kuģniecība, citi pārvadājumi, cauruļvadu transports, citi). Mainīgie lielumi un mērvienības: siltumnīcefekta gāzu emisijas (agregētās vai CO2, CH4, N2O, CO, NOx, SO2, NMGOS), izteiktas kt vai ktCO2eq, degvielas patēriņš, izteikts TJ, netiešie emisijas faktori (emitēto siltumnīcefekta gāzu masa uz degvielas enerģijas saturu) sadalījumā pa gāzes veidiem un degvielas veidiem, izteikti t/TJ vai kg/TJ. Saites: * Beļģijas iesniegtais ES SEG inventarizācijas pārskats – no 2024. gada (katra gada janvāris un marts): https://cdr.eionet.europa.eu/be/eu/govreg/inventory/ * Beļģijas iesniegtais ES SEG inventarizācijas pārskats – līdz 2023. gadam (katru gadu, sākot no 2015. gada, katru gadu janvārī un martā): https://cdr.eionet.europa.eu/ReportekEngine/searchdataflow?dataflow_uris=http%3A%2F%2Frod.eionet.europa.eu%2Fobligations%2F701&years%3Aint%3Aignore_empty=&partofyear=&reportingdate_start%3Adate%3Aignore_empty=&reportingdate_end%3Adate%3Aignore_empty=&country=http%3A%2F%2Frod.eionet.europa.eu%2Fspatial%2F5&release_status=anystatus&sort_on=reportingdate&sort_order=reverse&batch_size UNFCCC SEG inventarizācijas pārskata iesniegšana Beļģijā (katru gadu, sākot no 2003. gada, katra gada maija): https://unfccc.int/ghg-inventories-annex-i-parties/2023 * ES EEZ siltumnīcefekta gāzu datu skatītājs: https://www.eea.europa.eu/data-and-maps/data/data-viewers/greenhouse-gases-viewer * UNFCCC Siltumnīcefekta gāzu inventarizācijas datu portāls (https://di.unfccc.int/): elastīgs vaicājums (https://di.unfccc.int/flex_1. pielikum… @lv
description: Bakgrundsdataset om utsläpp från belgiska transporter sedan 1990: Geografisk gräns: Nationellt (Belgien) - Årtal: 1990 till år X-2 (årlig uppdatering av alla år från 1990) - Kategorier: transportsätt (inrikesflyg, internationell luftfart, vägtransporter (bilar, lätta nyttofordon, tunga nyttofordon, motorcyklar, andra), järnvägar, inre vattenvägar, internationell sjöfart, andra transporter, transport i rörledning, andra). Variabler och enheter: växthusgasutsläpp (aggregerade eller CO2, CH4, N2O, CO, NOx, SO2, NMVOC) i kt eller ktCO2eq, bränsleförbrukning i TJ, implicita emissionsfaktorer (vikt av växthusgaser som släpps ut per bränsleenergiinnehåll) per gastyp och bränsletyp i t/TJ eller kg/TJ. Länkar: * Belgisk inlämning av EU:s växthusgasinventering – från och med 2024 (januari och mars varje år): https://cdr.eionet.europa.eu/be/eu/govreg/inventory/ * Belgisk inlämning av EU:s växthusgasinventering – fram till 2023 (årligen, från 2015 och framåt, januari och mars varje år): https://cdr.eionet.europa.eu/ReportekEngine/searchdataflow?dataflow_uris=http%3A%2F%2Frod.eionet.europa.eu%2Fobligations%2F701&years%3Aint%3Aignore_empty=&partofyear=&reportingdate_start%3Adate%3Aignore_empty=&reportingdate_end%3Adate%3Aignore_empty=&country=http%3A%2F%2Frod.eionet.europa.eu%2Fspatial%2F5&release_status=anystatus&sort_on=reportingdate&sort_order=reverse&batch_size Belgiens inlämning av UNFCCC:s växthusgasinventering (årligen, från och med 2003, maj varje år): https://unfccc.int/ghg-inventories-annex-i-parties/2023 * EU EEA växthusgas data viewer: https://www.eea.europa.eu/data-and-maps/data/data-viewers/greenhouse-gases-viewer * UNFCCC:s portal för inventering av växthusgaser (https://di.unfccc.int/): flexibel fråga (https://di.unfccc.int/flex_annex1). * Nationell klimatkommission (årligen, från 2014, januari, mars och maj varje år): Rapporter | National Climate Commission (cnc-nkc.be) https://www.cnc-nkc.be/en/reports > Växthusgasinventering (se senaste inlämningen av dataset f… @sv
georeferencing method: iso-19148
transport mode: long-distance-coach
mobility theme: general-information-for-trip-planning
description: Kontekstualni skup podataka o emisijama iz belgijskog prometa od 1990.: Zemljopisna granica: Nacionalna (Belgija) – godina/godine: od 1990. do godine X-2 (godišnje ažuriranje za sve godine od 1990.) kategorije: načini prijevoza (domaće zrakoplovstvo, međunarodno zrakoplovstvo, cestovni prijevoz (automobili, laka gospodarska vozila, teška gospodarska vozila, motocikli, ostalo), željeznice, unutarnji plovni putovi, međunarodna pomorska plovidba, drugi prijevoz, cjevovodni prijevoz, ostalo). Varijable i jedinice: emisije stakleničkih plinova (agregirane ili CO2, CH4, N2O, CO, NOx, SO2, NMHOS) u kt ili ktCO2eq, potrošnja goriva u TJ, implicitni emisijski faktori (masa emitiranih stakleničkih plinova po energetskom sadržaju goriva) prema vrsti plina i vrsti goriva u t/TJ ili kg/TJ. Poveznice: * Belgijsko podnošenje inventara stakleničkih plinova u EU-u – od 2024. nadalje (siječanj i ožujak svake godine): https://cdr.eionet.europa.eu/be/eu/govreg/inventory/ * Belgijsko podnošenje inventara stakleničkih plinova u EU-u – do 2023. (godišnje, od 2015. nadalje, u siječnju i ožujku svake godine): https://cdr.eionet.europa.eu/ReportekEngine/searchdataflow?dataflow_uris=http%3A%2F%2Frod.eionet.europa.eu%2Fobligations%2F701&years%3Aint%3Aignore_empty=&partofyear=&reportingdate_start%3Adate%3Aignore_empty=&reportingdate_end%3Adate%3Aignore_empty=&country=http%3A%2F%2Frod.eionet.europa.eu%2Fspatial%2F5&release_status=anystatus&sort_on=reportingdate&sort_order=reverse&batch_size Belgijsko podnošenje inventara stakleničkih plinova UNFCCC-a (godišnje, od 2003. do svibnja svake godine): https://unfccc.int/ghg-inventories-annex-i-parties/2023 * Preglednik podataka EU-a o stakleničkim plinovima u EGP-u: https://www.eea.europa.eu/data-and-maps/data/data-viewers/greenhouse-gases-viewer * Portal UNFCCC-a za podatke o inventaru stakleničkih plinova (https://di.unfccc.int/): fleksibilan upit (https://di.unfccc.int/flex_annex1). * Nacionalna komisija za klimu (godišnje, od 2014., siječnja, ožuj… @hr
transport mode: shuttle-ferry
issued: 2023-04-27T09:20:44.107233
title: Belgische Verkehrsemissionen від 1990 @uk
description: Conjunto de datos contextuales sobre las emisiones del transporte belga desde 1990: - Límite geográfico: Nacional (Bélgica) - Año(s): 1990 al año X-2 (actualización anual de todos los años a partir de 1990) - Categorías: modos de transporte (aviación nacional, aviación internacional, transporte por carretera (automóviles, vehículos comerciales ligeros, vehículos comerciales pesados, motocicletas, otros), ferrocarriles, vías navegables interiores, transporte marítimo internacional, otros transportes, transporte por tuberías, otros). - Variables y unidades: emisiones de gases de efecto invernadero (agregadas o CO2, CH4, N2O, CO, NOx, SO2, COVNM) en kt o ktCO2eq, consumo de combustible en TJ, factores de emisión implícitos (peso de los gases de efecto invernadero emitidos por contenido energético del combustible) por tipo de gas y tipo de combustible en t/TJ o kg/TJ. Enlaces: * Presentación del inventario belga de GEI de la UE: a partir de 2024 (enero y marzo de cada año): https://cdr.eionet.europa.eu/be/eu/govreg/inventory/ * Presentación del inventario belga de GEI de la UE hasta 2023 (anual, a partir de 2015, enero y marzo de cada año): https://cdr.eionet.europa.eu/ReportekEngine/searchdataflow?dataflow_uris=http%3A%2F%2Frod.eionet.europa.eu%2Fobligations%2F701&years%3Aint%3Aignore_empty=&partofyear=&reportingdate_start%3Adate%3Aignore_empty=&reportingdate_end%3Adate%3Aignore_empty=&country=http%3A%2F%2Frod.eionet.europa.eu%2Fspatial%2F5&release_status=anystatus&sort_on=reportingdate&sort_order=reverse&batch_size Presentación del inventario belga de GEI de la CMNUCC (anual, a partir de 2003, mayo de cada año): https://unfccc.int/ghg-inventories-annex-i-parties/2023 * Visor de datos de gases de efecto invernadero del EEE de la UE: https://www.eea.europa.eu/data-and-maps/data/data-viewers/greenhouse-gases-viewer * Portal de datos del inventario de gases de efecto invernadero de la CMNUCC (https://di.unfccc.int/): consulta flexible (https://di.unfccc.int/flex_annex1). … @es
contact point: Kind
  fn: Climate Change Service
description: Belgijos transporto išmetamų teršalų kontekstinių duomenų rinkinys nuo 1990 m.: - Geografinės ribos: Nacionalinis (Belgija) - Metai: Nuo 1990 m. iki X-2 metų (metinis visų metų atnaujinimas nuo 1990 m.) Kategorijos: transporto rūšys (vidaus aviacija, tarptautinė aviacija, kelių transportas (automobiliai, lengvosios komercinės transporto priemonės, sunkiosios komercinės transporto priemonės, motociklai ir kt.), geležinkeliai, vidaus vandenų keliai, tarptautinė laivyba, kitas transportas, vamzdynų transportas ir kt.). - Kintamieji ir vienetai: išmetamas šiltnamio efektą sukeliančių dujų kiekis (bendras arba CO2, CH4, N2O, CO, NOx, SO2, NMLOJ) kt arba ktCO2eq, kuro sąnaudos TJ, numanomi išmetamųjų teršalų faktoriai (išmestų šiltnamio efektą sukeliančių dujų svoris pagal kuro energijos kiekį) pagal dujų rūšį ir kuro rūšį t/TJ arba kg/TJ. Nuorodos: * Belgijos pateikta ES ŠESD apskaitos ataskaita – nuo 2024 m. (kiekvienų metų sausio ir kovo mėn.): https://cdr.eionet.europa.eu/be/eu/govreg/inventory/ * Belgijos ES ŠESD apskaitos duomenys – iki 2023 m. (kasmet, nuo 2015 m., kiekvienų metų sausio ir kovo mėn.): https://cdr.eionet.europa.eu/ReportekEngine/searchdataflow?dataflow_uris=http%3A%2F%2Frod.eionet.europa.eu%2Fobligations%2F701&years%3Aint%3Aignore_empty=&partofyear=&reportingdate_start%3Adate%3Aignore_empty=&reportingdate_end%3Adate%3Aignore_empty=&country=http%3A%2F%2Frod.eionet.europa.eu%2Fspatial%2F5&release_status=anystatus&sort_on=reportingdate&sort_order=reverse&batch_size Belgijos pateikta JTBKKK ŠESD apskaitos ataskaita (kasmet, nuo 2003 m., kiekvienų metų gegužės mėn.): https://unfccc.int/ghg-inventories-annex-i-parties/2023 * ES EAA šiltnamio efektą sukeliančių dujų duomenų žiūryklė: https://www.eea.europa.eu/data-and-maps/data/data-viewers/greenhouse-gases-viewer * UNFCCC šiltnamio efektą sukeliančių dujų apskaitos duomenų portalas (https://di.unfccc.int/): lanksti užklausa (https://di.unfccc.int/flex_annex1). * Nacionalinė klimato komisija (kasmet, nuo 2… @lt
theme: TRANSPORT
landing page: https://transportdata.be/dataset/e9e63348-c1c4-460d-af61-e96febb9eacc#
transport mode: maritime
description: Контекстний набір даних про викиди від бельгійського транспорту з 1990 року: - Географічна межа: Національний (Бельгія) - Рік(и): 1990 до року X-2 (щорічне оновлення всіх років з 1990) - Категорії об'єктів: види транспорту (внутрішня авіація, міжнародна авіація, автомобільний транспорт (легкові автомобілі, легкі комерційні транспортні засоби, важкі комерційні транспортні засоби, мотоцикли, інше), залізниця, внутрішні водні шляхи, міжнародне судноплавство, інший транспорт, трубопровідний транспорт, інше). - Змінні та одиниці виміру: Викиди парникових газів (агреговані або CO2, CH4, N2O, CO, NOx, SO2, NMVOC) в кт або ktCO2eq, витрата палива в TJ, неявні фактори викидів (вага парникових газів, що виділяються на вміст енергії палива) за типом газу та типом палива в т/тДж або кг/тДж. Посилання на сайт: * Бельгійський ЄС GHG інвентаризації подання – з 2024 року і далі (січень і березень кожного року): https://cdr.eionet.europa.eu/be/eu/govreg/inventory/ * Бельгійське подання запасів ПГ ЄС – до 2023 року (рік, з 2015 року, січень та березень кожного року): https://cdr.eionet.europa.eu/ReportekEngine/searchdataflow?dataflow_uris=http%3A%2F%2Frod.eionet.europa.eu%2Fobligations%2F701&years%3Aint%3Aignore_empty=&partofyear=&reportingdate_start%3Adate%3Aignore_empty=&reportingdate_end%3Adate%3Aignore_empty=&country=http%3A%2F%2Frod.eionet.europa.eu%2Fspatial%2F5&release_status=anystatus&sort_on=reportingdate&sort_order=reverse&batch_size Бельгійський UNFCCC GHG інвентаризації подання (рік, з 2003, Травень кожного року): https://unfccc.int/ghg-inventories-annex-i-parties/2023 * Переглядач даних про парниковий газ ЄЕЗ: https://www.eea.europa.eu/data-and-maps/data/data-viewers/greenhouse-gases-viewer * Портал даних інвентаризації парникових газів UNFCCC (https://di.unfccc.int/): гнучкий запит (https://di.unfccc.int/flex_annex1). * Національна кліматична комісія (рік, з 2014 року, січень, березень і травень кожного року): * Звіти | National Climate Commission (cnc-nkc.be) https://w… @uk
spatial: Belgium
description: Kontextový soubor údajů o emisích z belgické dopravy od roku 1990: Zeměpisná hranice: Národní (Belgie) Rok (roky): 1990 až rok X-2 (roční aktualizace všech let od roku 1990) – Kategorie: druhy dopravy (vnitrostátní letectví, mezinárodní letectví, silniční doprava (osobní automobily, lehká užitková vozidla, těžká užitková vozidla, motocykly, ostatní), železnice, vnitrozemské vodní cesty, mezinárodní lodní doprava, ostatní doprava, potrubní doprava, ostatní). Proměnné a jednotky: emise skleníkových plynů (souhrnné nebo CO2, CH4, N2O, CO, NOx, SO2, NMVOC) v kt nebo kt ekvivalentu CO2, spotřeba paliva v TJ, implicitní emisní faktory (hmotnost skleníkových plynů emitovaných na energetický obsah paliva) podle typu plynu a typu paliva v t/TJ nebo kg/TJ. Odkazy: * Belgická inventura skleníkových plynů v EU – od roku 2024 (leden a březen každého roku): https://cdr.eionet.europa.eu/be/eu/govreg/inventory/ * Belgická inventura skleníkových plynů v EU – do roku 2023 (každoročně od roku 2015, ledna a března každého roku): https://cdr.eionet.europa.eu/ReportekEngine/searchdataflow?dataflow_uris=http%3A%2F%2Frod.eionet.europa.eu%2Fobligations%2F701&years%3Aint%3Aignore_empty=&partofyear=&reportingdate_start%3Adate%3Aignore_empty=&reportingdate_end%3Adate%3Aignore_empty=&country=http%3A%2F%2Frod.eionet.europa.eu%2Fspatial%2F5&release_status=anystatus&sort_on=reportingdate&sort_order=reverse&batch_size Belgická inventura skleníkových plynů podle UNFCCC (každoročně od roku 2003, květen každého roku): https://unfccc.int/ghg-inventories-annex-i-parties/2023 * Prohlížeč údajů o skleníkových plynech v EU: https://www.eea.europa.eu/data-and-maps/data/data-viewers/greenhouse-gases-viewer * Datový portál inventury skleníkových plynů UNFCCC (https://di.unfccc.int/): flexibilní dotaz (https://di.unfccc.int/flex_annex1). * Národní komise pro klima (každoročně od roku 2014, ledna, března a května každého roku): Zprávy | National Climate Commission (cnc-nkc.be) https://www.cnc-nkc.be/en/reports … @cs
description: Taustatietoa Belgian liikenteen päästöistä vuodesta 1990: Maantieteellinen raja: Kansallinen (Belgia) Vuosi (vuodet): 1990–X-2 (kaikkien vuosien vuotuinen päivitys vuodesta 1990 alkaen) - Luokat: liikennemuodot (kotimaan ilmailu, kansainvälinen ilmailu, maantieliikenne (autot, kevyet hyötyajoneuvot, raskaat hyötyajoneuvot, moottoripyörät, muut), rautatiet, sisävesiliikenne, kansainvälinen merenkulku, muu liikenne, putkijohtokuljetukset, muut). - Muuttujat ja yksiköt: kasvihuonekaasupäästöt (yhdistetyt tai CO2, CH4, N2O, CO, NOx, SO2, NMVOC) kilotonneina tai kilotonneina hiilidioksidiekvivalenttia, polttoaineenkulutus terajouleina (TJ), epäsuorat päästökertoimet (kasvihuonekaasupäästöjen paino polttoaineenergiasisältöä kohti) kaasutyypin ja polttoainetyypin mukaan (t/TJ tai kg/TJ). Linkkejä: * Belgian toimittamat EU:n kasvihuonekaasuinventaariot – vuodesta 2024 alkaen (kunkin vuoden tammi- ja maaliskuu): https://cdr.eionet.europa.eu/be/eu/govreg/inventory/ * Belgian toimittamat EU:n kasvihuonekaasuinventaariot – vuoteen 2023 saakka (vuosittain, vuodesta 2015 alkaen, kunkin vuoden tammi- ja maaliskuussa): https://cdr.eionet.europa.eu/ReportekEngine/searchdataflow?dataflow_uris=http%3A%2F%2Frod.eionet.europa.eu%2Fobligations%2F701&years%3Aint%3Aignore_empty=&partofyear=&reportingdate_start%3Adate%3Aignore_empty=&reportingdate_end%3Adate%3Aignore_empty=&country=http%3A%2F%2Frod.eionet.europa.eu%2Fspatial%2F5&release_status=anystatus&sort_on=reportingdate&sort_order=reverse&batch_size Belgian UNFCCC:n kasvihuonekaasuinventaarion toimittaminen (vuosittain, vuodesta 2003, kunkin vuoden toukokuu): https://unfccc.int/ghg-inventories-annex-i-parties/2023 * EU:n ja ETA:n kasvihuonekaasutietojen katseluohjelma: https://www.eea.europa.eu/data-and-maps/data/data-viewers/greenhouse-gases-viewer * UNFCCC:n kasvihuonekaasuinventaariotietojen portaali (https://di.unfccc.int/): joustava kysely (https://di.unfccc.int/flex_annex1). * Kansallinen ilmastotoimikunta (vuosittain, vuodesta 2… @fi
description: Kontekstualni nabor podatkov o emisijah iz belgijskega prometa od leta 1990: - Geografska meja: Nacionalno (Belgija) - Leto(-a): od leta 1990 do leta X-2 (letna posodobitev vseh let od leta 1990) - Kategorije: načini prevoza (domače letalstvo, mednarodno letalstvo, cestni promet (avtomobili, lahka gospodarska vozila, težka gospodarska vozila, motorna kolesa, drugo), železnice, celinske plovne poti, mednarodni ladijski promet, drugi promet, cevovodni promet, drugo). - Spremenljivke in enote: emisije toplogrednih plinov (združene ali CO2, CH4, N2O, CO, NOx, SO2, NMHOS) v kt ali ktCO2eq, poraba goriva v TJ, implicitni emisijski faktorji (teža izpuščenih toplogrednih plinov na energijsko vsebnost goriva) po vrsti plina in vrsti goriva v t/TJ ali kg/TJ. Povezave: * Belgijska predložitev evidenc toplogrednih plinov v EU – od leta 2024 naprej (vsako leto januarja in marca): https://cdr.eionet.europa.eu/be/eu/govreg/inventory/ * Belgijska predložitev evidenc toplogrednih plinov v EU – do leta 2023 (letno, od leta 2015 naprej, januarja in marca vsako leto): https://cdr.eionet.europa.eu/ReportekEngine/searchdataflow?dataflow_uris=http%3A%2F%2Frod.eionet.europa.eu%2Fobligations%2F701&years%3Aint%3Aignore_empty=&partofyear=&reportingdate_start%3Adate%3Aignore_empty=&reportingdate_end%3Adate%3Aignore_empty=&country=http%3A%2F%2Frod.eionet.europa.eu%2Fspatial%2F5&release_status=anystatus&sort_on=reportingdate&sort_order=reverse&batch_size Belgijska predložitev evidenc toplogrednih plinov UNFCCC (letno, od leta 2003, maja vsako leto): https://unfccc.int/ghg-inventories-annex-i-parties/2023 * Pregledovalnik podatkov o toplogrednih plinih v Evropski agenciji za okolje: https://www.eea.europa.eu/data-and-maps/data/data-viewers/greenhouse-gases-viewer * Podatkovni portal UNFCCC za popis toplogrednih plinov (https://di.unfccc.int/): prilagodljiva poizvedba (https://di.unfccc.int/flex_annex1). * Nacionalna podnebna komisija (letno, od leta 2014, januarja, marca in maja vsako leto): Poro… @sl
title: Belgische Verkehrsemissionen od roku 1990 @cs
description: Datensatz mit kontextbezogenen Daten über belgische Verkehrsemissionen ab 1990: - Geografische Begrenzung: national (Belgien) - Jahr(e): 1990 bis Jahr X-2 (jährliche Aktualisierung aller Jahre ab 1990) - Kategorien: Verkehrsträger (Inlandsflugverkehr, internationaler Flugverkehr, Straßenverkehr [Pkw, leichte Lkw, schwere Lkw, Motorräder, sonstige], Eisenbahn, Inlandsschifffahrt, internationale Schifffahrt, sonstiger Verkehr, Pipelinetransport, sonstige] - Variablen und Einheiten: Emission von Treibhausgasen (aggregiert oder CO2, CH4, N2O, CO, NOx, SO2, NMVOC) in kt oder ktCO2eq, Kraftstoffverbrauch in TJ, implizite Emissionsfaktoren (Gewicht der emittierten Treibhausgase pro Energiegehalt des Kraftstoffs) pro Gasart und pro Kraftstoffart in t/TJ oder kg/TJ. Links: * Belgian EU GHG inventory submission – from 2024 onwards (January and March of each year): https://cdr.eionet.europa.eu/be/eu/govreg/inventory/ * Belgian EU GHG inventory submission – until 2023 (yearly, from 2015 onwards, January and March of each year): https://cdr.eionet.europa.eu/ReportekEngine/searchdataflow?dataflow_uris=http%3A%2F%2Frod.eionet.europa.eu%2Fobligations%2F701&years%3Aint%3Aignore_empty=&partofyear=&reportingdate_start%3Adate%3Aignore_empty=&reportingdate_end%3Adate%3Aignore_empty=&country=http%3A%2F%2Frod.eionet.europa.eu%2Fspatial%2F5&release_status=anystatus&sort_on=reportingdate&sort_order=reverse&batch_size * Belgian UNFCCC GHG inventory submission (yearly, from 2003, May of each year): https://unfccc.int/ghg-inventories-annex-i-parties/2023 * EU EEA greenhouse gas data viewer: https://www.eea.europa.eu/data-and-maps/data/data-viewers/greenhouse-gases-viewer * UNFCCC Greenhouse Gas Inventory Data portal (https://di.unfccc.int/): flexible query (https://di.unfccc.int/flex_annex1). * National climate Commission (yearly, from 2014, January, March and May of each year): Reports | National Climate Commission (cnc-nkc.be) https://www.cnc-nkc.be/en/reports > GHG inventory (see most recen… @de
transport mode: tram-light-rail
temporal: PeriodOfTime
  start date: 1990-01-01T09:06:00
description: Taustaandmete kogum Belgia transpordisektori heitkoguste kohta alates 1990. aastast: - Geograafiline piir: Riiklik (Belgia) - Aasta(d): 1990–aasta X-2 (kõigi 1990. aasta aastate iga-aastane ajakohastamine) Kategooriad: transpordiliigid (siselennundus, rahvusvaheline lennundus, maanteetransport (autod, väikesed tarbesõidukid, rasked tarbesõidukid, mootorrattad, muud), raudteed, siseveeteed, rahvusvaheline laevandus, muu transport, torutransport, muu). - Muutujad ja ühikud: kasvuhoonegaaside heide (koguheide või CO2, CH4, N2O, CO, NOx, SO2, muude LOÜde kui metaani heide) kilovattides (kt) või kilovattides (ktCO2eq), kütusekulu kilovattides (TJ), kaudsed heitekoefitsiendid (heitgaaside kaal kütuse energiasisalduse kohta) gaasiliigi ja kütuseliigi kaupa (t/TJ) või kilogrammides kilovattides (kg/TJ). Lingid: * Belgia ELi kasvuhoonegaaside inventuuriandmete esitamine – alates 2024. aastast (iga aasta jaanuaris ja märtsis): https://cdr.eionet.europa.eu/be/eu/govreg/inventory/ * Belgia esitatud ELi kasvuhoonegaaside inventuuriandmed – kuni 2023. aastani (igal aastal, alates 2015. aastast, iga aasta jaanuaris ja märtsis): https://cdr.eionet.europa.eu/ReportekEngine/searchdataflow?dataflow_uris=http%3A%2F%2Frod.eionet.europa.eu%2Fobligations%2F701&years%3Aint%3Aignore_empty=&partofyear=&reportingdate_start%3Adate%3Aignore_empty=&reportingdate_end%3Adate%3Aignore_empty=&country=http%3A%2F%2Frod.eionet.europa.eu%2Fspatial%2F5&release_status=anystatus&sort_on=reportingdate&sort_order=reverse&batch_size Belgia ÜRO kliimamuutuste raamkonventsiooni kasvuhoonegaaside inventuuriandmete esitamine (iga aasta, alates 2003. aastast, iga aasta mai): https://unfccc.int/ghg-inventories-annex-i-parties/2023 * EL EEA kasvuhoonegaaside andmete vaataja: https://www.eea.europa.eu/data-and-maps/data/data-viewers/greenhouse-gases-viewer * UNFCCC kasvuhoonegaaside inventuuriandmete portaal (https://di.unfccc.int/): paindlik päring (https://di.unfccc.int/flex_annex1). * Riiklik kliimakomisjon (iga a… @et
description: Kontextový súbor údajov o emisiách z belgickej dopravy od roku 1990: - Geografická hranica: Národná (Belgicko) Rok (roky): 1990 až rok X-2 (ročná aktualizácia všetkých rokov od roku 1990) - Kategórie: druhy dopravy (vnútroštátne letectvo, medzinárodné letectvo, cestná doprava (automobily, ľahké úžitkové vozidlá, ťažké úžitkové vozidlá, motocykle, iné), železnice, vnútrozemské vodné cesty, medzinárodná lodná doprava, iná doprava, potrubná doprava, iné). - Premenné a jednotky: emisie skleníkových plynov (súhrnné alebo CO2, CH4, N2O, CO, NOx, SO2, NMVOC) v kt alebo kt ekvivalentu CO2, spotreba paliva v TJ, implicitné emisné faktory (hmotnosť skleníkových plynov emitovaných na energetický obsah paliva) podľa typu plynu a typu paliva v t/TJ alebo kg/TJ. Odkazy: * Predkladanie inventúry skleníkových plynov v Belgicku – od roku 2024 (január a marec každého roka): https://cdr.eionet.europa.eu/be/eu/govreg/inventory/ * Predloženie inventúry skleníkových plynov v Belgicku – do roku 2023 (každoročne, od roku 2015, v januári a marci každého roka): https://cdr.eionet.europa.eu/ReportekEngine/searchdataflow?dataflow_uris=http%3A%2F%2Frod.eionet.europa.eu%2Fobligations%2F701&years%3Aint%3Aignore_empty=&partofyear=&reportingdate_start%3Adate%3Aignore_empty=&reportingdate_end%3Adate%3Aignore_empty=&country=http%3A%2F%2Frod.eionet.europa.eu%2Fspatial%2F5&release_status=anystatus&sort_on=reportingdate&sort_order=reverse&batch_size Predkladanie inventúry skleníkových plynov UNFCCC v Belgicku (každoročne od roku 2003, v máji každého roka): https://unfccc.int/ghg-inventories-annex-i-parties/2023 * Prehliadač údajov o skleníkových plynoch v EHP: https://www.eea.europa.eu/data-and-maps/data/data-viewers/greenhouse-gases-viewer *Inventarizačný dátový portál UNFCCC o skleníkových plynoch (https://di.unfccc.int/): flexibilný dotaz (https://di.unfccc.int/flex_annex1). * Národná komisia pre klímu (každoročne od roku 2014, januára, marca a mája každého roka): Správy | Národná komisia pre klímu (… @sk
description: Kontekstowy zbiór danych dotyczących emisji z transportu belgijskiego od 1990 r.: Granica geograficzna: Krajowy (Belgia) Rok (lata): 1990 do roku X-2 (roczna aktualizacja wszystkich lat od 1990 r.) - Kategorie: rodzaje transportu (lotnictwo krajowe, lotnictwo międzynarodowe, transport drogowy (samochody osobowe, lekkie pojazdy użytkowe, ciężkie pojazdy użytkowe, motocykle, inne), koleje, śródlądowe drogi wodne, żegluga międzynarodowa, inny transport, transport rurociągowy, inne). Zmienne i jednostki: emisje gazów cieplarnianych (zagregowane lub CO2, CH4, N2O, CO, NOx, SO2, NMLZO) w kt lub ktCO2eq, zużycie paliwa w TJ, ukryte współczynniki emisji (waga gazów cieplarnianych emitowanych na zawartość energii w paliwie) według rodzaju gazu i rodzaju paliwa w t/TJ lub kg/TJ. Linki: * Przedłożenie belgijskiego wykazu gazów cieplarnianych w UE – począwszy od 2024 r. (styczeń i marzec każdego roku): https://cdr.eionet.europa.eu/be/eu/govreg/inventory/ * Przedłożenie belgijskiego wykazu gazów cieplarnianych w UE – do 2023 r. (rocznie, począwszy od 2015 r., stycznia i marca każdego roku): https://cdr.eionet.europa.eu/ReportekEngine/searchdataflow?dataflow_uris=http%3A%2F%2Frod.eionet.europa.eu%2Fobligations%2F701&years%3Aint%3Aignore_empty=&partofyear=&reportingdate_start%3Adate%3Aignore_empty=&reportingdate_end%3Adate%3Aignore_empty=&country=http%3A%2F%2Frod.eionet.europa.eu%2Fspatial%2F5&release_status=anystatus&sort_on=reportingdate&sort_order=reverse&batch_size Przedłożenie belgijskiego wykazu gazów cieplarnianych UNFCCC (rocznie, od 2003 r., w maju każdego roku): https://unfccc.int/ghg-inventories-annex-i-parties/2023 * Przeglądarka danych dotyczących gazów cieplarnianych w EOG: https://www.eea.europa.eu/data-and-maps/data/data-viewers/greenhouse-gases-viewer * Portal danych UNFCCC dotyczących wykazów gazów cieplarnianych (https://di.unfccc.int/): elastyczne zapytanie (https://di.unfccc.int/flex_annex1). * Krajowa Komisja ds. Klimatu (rocznie, od 2014 r., w styczniu, marc… @pl
modified: 2024-12-18T12:03:54.302527

Belgian Climate Centre
type: Organization
type: Agent
type: National authority

National authority
type: Concept
preferred label: Nationale Autoriteit @nl
preferred label: Autorité Nationale @fr
in scheme: http://purl.org/adms/publishertype/1.0
preferred label: National Authority
preferred label: Nationaal orgaan @nl

English
type: Concept
preferred label: Engels @nl
in scheme: language
preferred label: Englisch @de
type: LinguisticSystem
preferred label: Anglais @fr
preferred label: anglais @fr

annual
type: Frequency
in scheme: frequency
preferred label: jaarlijks @nl
type: Concept
preferred label: annuel @fr
preferred label: jährlich @de

2023 submission of Belgian transport emissions from 1990
type: Distribution
data format notes: The Belgian GHG emission inventory is compiled based on three regional GHG inventories of Flanders, Wallonia and Brussels and approved by the National Climate Commission. The inventory is compiled on a yearly basis and submitted to the EU by January and March of each year and provides a detailed overview of sectoral territorial GHG emissions in Belgium from the year 1990 up to the year X-2. Subsequently, by April (Belgium) and May (Europe) of each year, the same information is submitted to the UNFCCC (https://unfccc.int/ghg-inventories-annex-i-parties/2023: Belgian inventories available from 2003 onwards) and integrated in the UNFCCC Greenhouse Gas Inventory Data portal (https://di.unfccc.int/). Via a flexible query (https://di.unfccc.int/flex_annex1), a chosen subset of all national GHG inventories can be downloaded in a tabular structure that suits best the final end-use. Belgian domestic (A.) and international (B.) transport emissions are reported separately within the category ‘1. Energy’ of the emission inventory: A. Belgian domestic transport-related emissions fall within the subcategory ‘1.AA Fuel Combustion – Sectoral Approach’ -> ‘1.A.3 Transport’. [see excel/csv 240610_di-unfccc_1.A.3-transport.xlsx/csv] This section of the EU and UNFCCC GHG inventory data is structured according to: 1) Party * Belgium, … 2) Year: * Base year, 1990 to year X-2 (yearly) 3) Category: subcategory ‘1.A.3 Transport’ of category ‘1. Energy’. * 1.A.3 Transport * 1.A.3.a Domestic Aviation * 1.A.3.b Road Transportation * 1.A.3.b.i Cars * 1.A.3.b.ii Light Duty Trucks * 1.A.3.b.iii Heavy Duty Trucks and Buses * 1.A.3.b.iv Motorcycles * 1.A.3.b.v Other * 1.A.3.c Railways * 1.A.3.d Domestic Navigation * 1.A.3.e Other Transportation * 1.A.3.e.i Pipeline Transport * 1.A.3.e.ii Other 4) Type of value: Gas \ Unit * Aggregate GHGs * CO₂ * CH₄ * N₂O * CO * NOₓ * SO₂ * NMVOC * No gas 5) Classification \ Unit * Total for category * Biomass * Gaseous Fuels * Liquid Fuels * Other Fossil Fuels * … @fr
application layer protocol: http-https
title: Представяне през 2023 г. на емисиите от транспорта в Белгия от 1990 г. @bg
title: Υποβολή των βελγικών εκπομπών από τις μεταφορές το 2023 από το 1990 @el
title: Podnošenje emisija iz belgijskog prometa za 2023. iz 1990. @hr
grammar: other
title: Astaíochtaí iompair na Beilge ó 1990 a chur isteach in 2023 @ga
modified: 2024-06-10T12:29:04.158600
title: 2023 подання бельгійських транспортних викидів з 1990 року @uk
title: Preżentazzjoni tal-2023 tal-emissjonijiet mit-trasport Belġjan mill-1990 @mt
character encoding: Other
access URL: https://transportdata.be/dataset/e9e63348-c1c4-460d-af61-e96febb9eacc/resource/4ddc0cb7-636e-4bc7-beac-c5d8a42908d2/download/240610_di-unfccc_1.zip
title: Prezentarea în 2023 a emisiilor generate de transportul belgian din 1990 @ro
title: Belgian liikenteen vuoden 1990 päästöjen ilmoittaminen vuonna 2023 @fi
availability: AVAILABLE
title: Indiening 2023 van de Belgische vervoersemissies vanaf 1990 @nl
title: A közlekedésből származó, 1990-ből származó belga kibocsátások 2023. évi benyújtása @hu
download URL: https://transportdata.be/dataset/e9e63348-c1c4-460d-af61-e96febb9eacc/resource/4ddc0cb7-636e-4bc7-beac-c5d8a42908d2/download/240610_di-unfccc_1.zip
title: 2023-indberetning af belgiske transportemissioner fra 1990 @da
title: Předložení belgických emisí z dopravy od roku 1990 za rok 2023 @cs
title: Apresentação, em 2023, das emissões dos transportes belgas de 1990 @pt
title: Presentazione 2023 delle emissioni dei trasporti belgi dal 1990 @it
title: Beļģijas 2023. gadā iesniegtās transporta emisijas no 1990. gada @lv
title: Inlämning 2023 av belgiska transportutsläpp från 1990 @sv
title: Przedłożenie w 2023 r. danych dotyczących emisji z transportu belgijskiego z 1990 r. @pl
title: Predloženie belgických emisií z dopravy za rok 2023 z roku 1990 @sk
title: Belgia transpordisektori heide alates 1990. aastast 2023. aastal @et
title: Predložitev belgijskih emisij iz prometa iz leta 1990 v letu 2023 @sl
issued: 2024-06-10T12:29:04.158600
title: 2023 m. Belgijos transporto sektoriuje išmestų teršalų kiekis nuo 1990 m. @lt
title: Presentación en 2023 de las emisiones del transporte belga de 1990 @es
communication method: pull
license: CC PDM 1 0
format: ZIP
mobility data standard: other

ZIP
type: MediaTypeOrExtent
type: MediaType
in scheme: file-type
type: Concept

TRANSPORT
type: Concept
in scheme: datatheme
preferred label: Transports @fr
in scheme: data-theme
preferred label: Transport
preferred label: Verkehr @de
preferred label: Vervoer @nl

Belgium
type: Location