Gemeten en voorspelde totale belasting op het Belgische net (historische gegevens)
type: Dataset
description: Gemeten in opgeschaalde, meest recente, day-ahead in week-ahead voorspellingen voor de total belasting op het Belgische net.
accrual periodicity: dagelijks
title: Measured and forecasted total load on the Belgian grid (Historical data) @en
description: Gemeten in opgeschaalde, meest recente, ġurnata bil-quddiem fil-ġimgħa bil-quddiem voorspellingen voor de total belasting op het Belgische net. @mt
title: Gemeten en voorspelde total belasting op het Belgische net (historische gegevens) Systémové Požiadavky @sk
title: Gemessene und prognostizierte Gesamtlast des belgischen Netzes (Historische Daten) @de
description: Gemeten in opgeschaalde, meest recente, day-ahead in week-ahead voorspellingen voor de total belasting op het belgická síť. @cs
title: Gemeten en voorspelde total belasting op het Belgische net (historische gegevens)
publisher: Elia
language: Engels
description: Gemessene und gehobene, aktuelle, Day-Ahead- und Week-Ahead-Prognosen für die Gesamtlast im belgischen Netz. @de
keyword: EU Reg. No 534/2013 @en
description: Gemeten i opgeschaalde, le déanaí is mó, lá roimh ré i voorspellingen voor de iomlán belasting op het Belgische glan. @ga
description: Gemeten in opgeschaalde, meest recente, day-ahead in week-ahead voorspellingen voor de total belasting op het Belgische net. - Kto odpowiedział? @pl
description: Gemeten in opgeschaalde, meest recente, day-ahead in week-ahead voorspellingen voor de total belasting op het Belgische net (angol nyelven). @hu
modified: 2026-05-29T08:58:42Z
title: Gemeten en voorspelde total belasting op het Belgische net (historische gegevens) (Геметен и воорспелде — общо дълготрайна оп хетна белгишка мрежа) @bg
description: Gemeten en opgeschaalde, meest recente, day-ahead en week-ahead voorspellingen voor de totale belasting op het Belgische net.
title: Gemeten en voorspelde total belasting op het Belgische net (історичні гегевени) @uk
title: Gemeten en voorspelde total belasting op het Belgische net (historische gegevens) - opinie, recenzje użytkowników, ekspertów, porównanie cen. - alaTest.pl @pl
title: Gemeten en voorspelde total belasting op het Belgische net (historische gegevens) Sisteminiai Reikalavimai @lt
title: Gemeten en voorspelde iomlán belasting op het Belgische glan (historische gegevens) @ga
description: Gemeten in opgeschaalde, meest recent, day-ahead in week-ahead voorspellingen voor de total belasting op het Belgische net. @ro
contact point: Kind
  fn: Elia
description: Gemeten in opgeschaalde, meest recente, day-ahead in week-ahead voorspellingen voor de total belasting op het Belgische net (en inglés). @es
title: Gemeten en voorspelde total belasting op het Belgische net (historische gegevens) Systémové požadavky @cs
description: Gemeten en opgeschaalde, meest recente, day-ahead en week-ahead voorspellingen voor de total belasting op het Belgische net. @de
description: Gemeten in opgeschaalde, meest recente, day-ahead in week-ahead voorspellingen voor de total belasting op het Belgian verkko. @fi
description: Gemeten in opgeschaalde, meest recente, diena-ahead in nedēļa-ahead voorspellingen voor de total belasting op het Belgische net. @lv
title: Gemeten en voorspelde total belasting op het Belgische net (historische gegevens) (angol nyelven). @hu
theme: Energie
title: Gemeten en voorspelde total belasting op het Belgische net (ιστορικά gegevens) @el
title: Gemeten en voorspelde totale belasting op het Belgische net (storische gegevens) @it
description: Gemeten in opgeschaalde, meest recente, dan vnaprej v tednu vnaprej voorspellingen voor de total belasting op het Belgische net. @sl
issued: 2026-05-29T08:58:42Z
keyword: Consumption @en
spatial: Belgium
description: Measured and upscaled, most recent, day-ahead and week-ahead forecasts for total load on the Belgian grid. @en
description: Gemeten в opgeschaalde, meest recente, ден напред в седмица напред voorspellingen voor de total belasting op het Belgische net. @bg
title: Gemeten en voorspelde total belasting op het Belgische net (historische gegevens) (angleščina). @sl
title: Gemeten en voorspelde total belasting op het Belgische net (historische gegevens) Sistēmas Prasības @lv
description: Gemeten u opgeschaalde, meest recente, dan unaprijed u tjednu unaprijed voorspellingen voor de total belasting op het Belgische net. @hr
description: Prévisions mesurées et mises à l'échelle, les plus récentes, à un jour et à une semaine pour la charge totale sur le réseau belge. @fr
access rights: openbaar
title: Charge totale mesurée et prévue sur le réseau belge (Données historiques) @fr
title: Gemeten en voorspelde total belasting op het Yhdistynyt kuningaskunta net (historische gegevens) @fi
title: Gemeten en voorspelde total belasting op het Belgische net (historische gegevens) (în limba engleză) @ro
landing page: https://opendata.elia.be/explore/dataset/ods001/information/
subject: https://opendata.elia.be/explore/
description: Gemeten in opgeschaalde, meest recente, dagen före i veckan före voorspellingen voor de total belasting op het Belgische net. @sv
title: Gemeten en voorspelde total belasting op het Belgische net (historische gegevens) (inte översatt till svenska) @sv
description: Gemeten in opgeschaalde, meest recente, на день вперед у тиждень вперед voorspellingen voor de total belasting op het Belgische net. @uk
description: Gemeten in opgeschaalde, mees recente, päev-ette nädal-ette voorspellingen voor de total belasting op het Belgische net. @et

dagelijks
type: Frequency
in scheme: frequency
preferred label: täglich @de
preferred label: quotidien @fr
preferred label: daily @en
type: Concept

ods001.n3
type: Distribution
license: Elia Open Data License
description: Izmjereno i predviđeno ukupno opterećenje na belgijskoj mreži (povijesni podaci) (n3) @hr
description: Naměřené a předpokládané celkové zatížení belgické sítě (historické údaje) (n3) @cs
description: Gemeten en voorspelde totale belasting op het Belgische net (historische gegevens) (n3)
description: Namerané a predpokladané celkové zaťaženie belgickej siete (historické údaje) (n3) @sk
description: Sarcina totală măsurată și prognozată pe grila belgiană (date istorice) (n3) @ro
description: Измерен и прогнозен общ товар на белгийската електроенергийна мрежа (исторически данни) (n3) @bg
availability: AVAILABLE
description: Tagħbija totali mkejla u mbassra fuq il-grilja Belġjana (Data storika) (n3) @mt
format: N3
description: Measured and forecasted total load on the Belgian grid (Historische Daten) (n3) @de
description: Belgian verkon mitattu ja ennustettu kokonaiskuormitus (historialliset tiedot) (n3) @fi
description: Målt og forventet samlet belastning på det belgiske net (historiske data) (n3) @da
description: Вимірюване та прогнозоване загальне навантаження на бельгійську мережу (Історичні дані) (n3) @uk
description: Išmatuota ir prognozuojama bendra Belgijos tinklo apkrova (istoriniai duomenys) (n3) @lt
description: A belga hálózat mért és előre jelzett teljes terhelése (történelmi adatok) (n3) @hu
download URL: https://opendata.elia.be/api/explore/v2.1/catalog/datasets/ods001/exports/n3#
description: Ualach iomlán tomhaiste agus tuartha ar ghreille na Beilge (Sonraí stairiúla) (n3) @ga
description: Mõõdetud ja prognoositav kogukoormus Belgia võrgus (ajaloolised andmed) (n3) @et
media type: https://www.iana.org/assignments/media-types/text/n3
description: Zmierzone i prognozowane całkowite obciążenie sieci belgijskiej (dane historyczne) (n3) @pl
issued: 2026-05-29T08:58:42Z
access URL: https://opendata.elia.be/explore/dataset/ods001/information/
description: Carico totale misurato e previsto sulla rete belga (dati storici) (n3) @it
modified: 2026-05-29T08:58:42Z
description: Izmerjena in napovedana skupna obremenitev belgijskega omrežja (zgodovinski podatki) (n3) @sl
language: Engels
description: Carga total medida e prevista na rede belga (dados históricos) (n3) @pt
description: Measured and forecasted total load on the Belgian grid (Historical data) (n3) @en
description: Carga total medida y prevista en la red belga (datos históricos) (n3) @es
description: Uppmätt och prognostiserad total belastning på det belgiska rutnätet (historiska uppgifter) (n3) @sv
description: Izmērītā un prognozētā kopējā slodze Beļģijas tīklā (vēsturiskie dati) (n3) @lv
description: Μετρούμενο και προβλεπόμενο συνολικό φορτίο στο βελγικό δίκτυο (Ιστορικά δεδομένα) (n3) @el

Elia Open Data License
type: LicenseDocument
type: Naamsvermelding

Naamsvermelding
type: Concept
preferred label: Attribution
in scheme: http://purl.org/adms/licencetype/1.0
notation: Attribution
type: LicenseDocument
preferred label: Verplichte bronvermelding

N3
type: Concept
in scheme: file-type
type: MediaTypeOrExtent

Engels
type: LinguisticSystem
preferred label: English @en
preferred label: anglais @fr
in scheme: language
preferred label: Anglais @fr
type: Concept
preferred label: Englisch @de

Elia
type: Agent
type: Organization
type: Bedrijf

Bedrijf
type: Concept
preferred label: Company @en
in scheme: http://purl.org/adms/publishertype/1.0

ods001.json
type: Distribution
description: Sarcina totală măsurată și prognozată pe rețeaua belgiană (date istorice) (json) @ro
description: Ualach iomlán tomhaiste agus tuartha ar ghreille na Beilge (Sonraí stairiúla) (json) @ga
description: Izmjereno i predviđeno ukupno opterećenje na belgijskoj mreži (povijesni podaci) (json) @hr
format: JSON
access URL: https://opendata.elia.be/explore/dataset/ods001/information/
description: Μετρούμενο και προβλεπόμενο συνολικό φορτίο στο βελγικό δίκτυο (Ιστορικά δεδομένα) (json) @el
availability: AVAILABLE
description: Measured and forecasted total load on the Belgian grid (Historical data) (json) @en
description: Målt og forventet samlet belastning på det belgiske net (historiske data) (json) @da
description: A belga hálózat mért és előre jelzett teljes terhelése (történelmi adatok) (json) @hu
license: Elia Open Data License
description: Naměřené a předpokládané celkové zatížení belgické sítě (historické údaje) (json) @cs
description: Tagħbija totali mkejla u mbassra fuq il-grilja Belġjana (Data storika) (json) @mt
description: Uppmätt och prognostiserad total belastning på det belgiska rutnätet (historiska data) (json) @sv
description: Carico totale misurato e previsto sulla rete belga (dati storici) (json) @it
description: Mõõdetud ja prognoositav kogukoormus Belgia võrgus (ajaloolised andmed) (json) @et
description: Išmatuota ir prognozuojama bendra Belgijos tinklo apkrova (istoriniai duomenys) (json) @lt
media type: application/json
description: Zmierzone i prognozowane całkowite obciążenie sieci belgijskiej (dane historyczne) (json) @pl
description: Izmerjena in napovedana skupna obremenitev belgijskega omrežja (zgodovinski podatki) (json) @sl
description: Belgian verkon mitattu ja ennustettu kokonaiskuormitus (historialliset tiedot) (json) @fi
description: Measured and forecasted total load on the Belgian grid (Geschichtliche Daten) (json) @de
description: Carga total medida y prevista en la red belga (datos históricos) (json) @es
description: Вимірюване та прогнозоване загальне навантаження на бельгійську мережу (Історичні дані) (json) @uk
download URL: https://opendata.elia.be/api/explore/v2.1/catalog/datasets/ods001/exports/json#
description: Carga total medida e prevista na rede belga (dados históricos) (json) @pt
issued: 2026-05-29T08:58:42Z
description: Namerané a predpokladané celkové zaťaženie belgickej rozvodnej siete (historické údaje) (json) @sk
description: Gemeten en voorspelde totale belasting op het Belgische net (Historische gegevens) (json)
modified: 2026-05-29T08:58:42Z
language: Engels
description: Izmērītā un prognozētā kopējā slodze Beļģijas tīklā (vēsturiskie dati) (json) @lv
description: Измерен и прогнозен общ товар на белгийската електроенергийна мрежа (исторически данни) (json) @bg

JSON
type: MediaTypeOrExtent
type: Concept
in scheme: file-type

application/json
type: Concept
in scheme: media-types
type: MediaType

ods001.xlsx
type: Distribution
availability: AVAILABLE
modified: 2026-05-29T08:58:42Z
description: Carga total medida e prevista na rede belga (dados históricos) (xlsx) @pt
format: XLSX
language: Engels
description: Sarcina totală măsurată și prognozată pe grila belgiană (date istorice) (xlsx) @ro
description: Carico totale misurato e previsto sulla rete belga (dati storici) (xlsx) @it
description: Measured and forecasted total load on the Belgian grid (Historical data) (xlsx) @en
description: Zmierzone i prognozowane całkowite obciążenie sieci belgijskiej (dane historyczne) (xlsx) @pl
license: Elia Open Data License
description: Tagħbija totali mkejla u mbassra fuq il-grilja Belġjana (Data storika) (xlsx) @mt
description: Izmerjena in napovedana skupna obremenitev belgijskega omrežja (zgodovinski podatki) (xlsx) @sl
description: Carga total medida y prevista en la red belga (datos históricos) (xlsx) @es
description: Išmatuota ir prognozuojama bendra Belgijos tinklo apkrova (istoriniai duomenys) (xlsx) @lt
description: Gemeten en voorspelde totale belasting op het Belgische net (Historische gegevens) (xlsx)
description: Izmjereno i predviđeno ukupno opterećenje na belgijskoj mreži (povijesni podaci) (xlsx) @hr
description: Izmērītā un prognozētā kopējā slodze Beļģijas tīklā (vēsturiskie dati) (xlsx) @lv
description: Вимірюване та прогнозоване загальне навантаження на бельгійську мережу (Історичні дані) (xlsx) @uk
description: Μετρούμενο και προβλεπόμενο συνολικό φορτίο στο βελγικό δίκτυο (Ιστορικά δεδομένα) (xlsx) @el
description: A belga hálózat mért és előre jelzett teljes terhelése (történelmi adatok) (xlsx) @hu
description: Измерен и прогнозен общ товар върху белгийската мрежа (исторически данни) (xlsx) @bg
description: Mõõdetud ja prognoositav kogukoormus Belgia võrgus (ajaloolised andmed) (xlsx) @et
description: Ualach iomlán tomhaiste agus tuartha ar ghreille na Beilge (Sonraí stairiúla) (xlsx) @ga
description: Målt og forventet samlet belastning på det belgiske net (historiske data) (xlsx) @da
access URL: https://opendata.elia.be/explore/dataset/ods001/information/
description: Uppmätt och prognostiserad total belastning på det belgiska rutnätet (historiska data) (xlsx) @sv
description: Naměřené a předpokládané celkové zatížení belgické sítě (historické údaje) (xlsx) @cs
description: Measured and forecasted total load on the Belgian grid (Historische Daten) (xlsx) @de
description: Namerané a predpokladané celkové zaťaženie belgickej siete (historické údaje) (xlsx) @sk
media type: application/vnd.openxmlformats-officedocument.spreadsheetml.sheet
issued: 2026-05-29T08:58:42Z
download URL: https://opendata.elia.be/api/explore/v2.1/catalog/datasets/ods001/exports/xlsx#
description: Belgian verkon mitattu ja ennustettu kokonaiskuormitus (historialliset tiedot) (xlsx) @fi

XLSX
type: MediaTypeOrExtent
preferred label: Excel XLSX
type: Concept
in scheme: file-type

application/vnd.openxmlformats-officedocument.spreadsheetml.sheet
type: Concept
preferred label: XLSX
type: MediaType

ods001.rdf
type: Distribution
modified: 2026-05-29T08:58:42Z
description: Tagħbija totali mkejla u mbassra fuq il-grilja Belġjana (Data storika) (rdfxml) @mt
description: Naměřené a předpokládané celkové zatížení belgické sítě (historická data) (rdfxml) @cs
description: Izmērītā un prognozētā kopējā slodze Beļģijas tīklā (vēsturiskie dati) (rdfxml) @lv
description: Namerané a predpokladané celkové zaťaženie belgickej mriežky (historické údaje) (rdfxml) @sk
description: Carga total medida e prevista na rede belga (dados históricos) (rdfxml) @pt
description: Zmierzone i prognozowane całkowite obciążenie sieci belgijskiej (dane historyczne) (rdfxml) @pl
description: Carico totale misurato e previsto sulla griglia belga (dati storici) (rdfxml) @it
license: Elia Open Data License
language: Engels
description: Uppmätt och prognostiserad total belastning på det belgiska rutnätet (historiska data) (rdfxml) @sv
description: Išmatuota ir prognozuojama bendra Belgijos tinklo apkrova (istoriniai duomenys) (rdfxml) @lt
description: Carga total medida y prevista en la red belga (datos históricos) (rdfxml) @es
download URL: https://opendata.elia.be/api/explore/v2.1/catalog/datasets/ods001/exports/rdfxml#
media type: rdf+xml
description: Μετρούμενο και προβλεπόμενο συνολικό φορτίο στο βελγικό δίκτυο (Ιστορικά δεδομένα) (rdfxml) @el
availability: AVAILABLE
description: Measured and forecasted total load on the Belgian grid (Historical data) (rdfxml) @en
description: Målt og forventet samlet belastning på det belgiske net (historiske data) (rdfxml) @da
issued: 2026-05-29T08:58:42Z
description: Вимірюване та прогнозоване загальне навантаження на бельгійську мережу (Історичні дані) (rdfxml) @uk
access URL: https://opendata.elia.be/explore/dataset/ods001/information/
description: Gemeten en voorspelde totale belasting op het Belgische net (Historische gegevens) (rdfxml)
description: Mõõdetud ja prognoositav kogukoormus Belgia võrgus (ajaloolised andmed) (rdfxml) @et
description: Izmerjena in napovedana skupna obremenitev belgijskega omrežja (zgodovinski podatki) (rdfxml) @sl
description: Ualach iomlán tomhaiste agus tuartha ar ghreille na Beilge (Sonraí stairiúla) (rdfxml) @ga
description: Измерен и прогнозен общ товар върху белгийската мрежа (исторически данни) (rdfxml) @bg
description: A belga hálózat mért és előre jelzett teljes terhelése (történelmi adatok) (rdfxml) @hu
description: Belgian verkon mitattu ja ennustettu kokonaiskuormitus (historialliset tiedot) (rdfxml) @fi
format: RDF/XML
description: Izmjereno i predviđeno ukupno opterećenje na belgijskoj mreži (povijesni podaci) (rdfxml) @hr
description: Sarcina totală măsurată și prognozată pe grila belgiană (date istorice) (rdfxml) @ro
description: Measured and forecasted total load on the Belgian grid (Historische Daten) (rdfxml) @de

RDF/XML
type: MediaTypeOrExtent
in scheme: file-type
type: Concept

Energie
type: Concept
preferred label: Énergie @fr
in scheme: datatheme
preferred label: ENERGY @en
preferred label: Energy @en
in scheme: data-theme

ods001.parket
type: Distribution
title: ods001.parquet @da
title: ods001.παρκέ @el
title: ods001.parkett @et
download URL: https://opendata.elia.be/api/explore/v2.1/catalog/datasets/ods001/exports/parquet#
description: Belgian verkon mitattu ja ennustettu kokonaiskuormitus (historialliset tiedot) @fi
license: Elia Open Data License
description: Carga total medida y prevista en la red belga (datos históricos) @es
description: Gemeten en voorspelde totale belasting op het Belgische net (historische gegevens)
description: Measured and forecasted total load on the Belgian grid (Historical data) (parquet) @en
description: Carga total medida e prevista na rede belga (dados históricos) @pt
description: Carico totale misurato e previsto sulla rete belga (dati storici) @it
title: ods001.parketta @hu
description: A belga hálózat mért és előre jelzett teljes terhelése (történelmi adatok) @hu
format: Parquet
description: Izmerjena in napovedana skupna obremenitev belgijskega omrežja (zgodovinski podatki) @sl
access URL: https://opendata.elia.be/explore/dataset/ods001/information/
description: Tagħbija totali mkejla u mbassra fuq il-grilja Belġjana (Data storika) @mt
description: Išmatuota ir prognozuojama bendra Belgijos tinklo apkrova (istoriniai duomenys) @lt
description: Zmierzone i prognozowane całkowite obciążenie sieci belgijskiej (dane historyczne) @pl
description: Uppmätt och prognostiserad total belastning på det belgiska rutnätet (historiska uppgifter) @sv
issued: 2026-05-29T08:58:42Z
description: Sarcina totală măsurată și prognozată pe rețeaua belgiană (date istorice) @ro
description: Izmjereno i predviđeno ukupno opterećenje na belgijskoj mreži (povijesni podaci) @hr
description: Målt og forventet samlet belastning på det belgiske net (historiske data) @da
description: Naměřené a předpokládané celkové zatížení belgické sítě (historické údaje) @cs
description: Namerané a predpokladané celkové zaťaženie belgickej rozvodnej siete (historické údaje) @sk
title: ods001.паркет @bg
title: ods001.parkety @cs
description: Вимірюване та прогнозоване загальне навантаження на бельгійську мережу (Історичні дані) @uk
description: Mõõdetud ja prognoositav kogukoormus Belgia võrgus (ajaloolised andmed) @et
description: Μετρούμενο και προβλεπόμενο συνολικό φορτίο στο βελγικό δίκτυο (Ιστορικά δεδομένα) @el
modified: 2026-05-29T08:58:42Z
availability: AVAILABLE
media type: parquet
description: Izmērītā un prognozētā kopējā slodze Beļģijas tīklā (vēsturiskie dati) @lv
description: Измерен и прогнозен общ товар на белгийската електроенергийна мрежа (исторически данни) @bg
description: Ualach iomlán tomhaiste agus tuartha ar ghreille na Beilge (Sonraí stairiúla) @ga
language: Engels
title: ods001.parkets @lv
description: Measured and forecasted total load on the Belgian grid (Historische Daten) (Staatsanwaltschaft) @de

Parquet
type: Concept
in scheme: file-type
type: MediaTypeOrExtent

Belgium
type: Location

ods001.jsonld
type: Distribution
description: Carico totale misurato e previsto sulla rete belga (dati storici) (jsonld) @it
media type: ld+json
access URL: https://opendata.elia.be/explore/dataset/ods001/information/
license: Elia Open Data License
description: Namerané a predpokladané celkové zaťaženie belgickej rozvodnej siete (historické údaje) (jsonld) @sk
description: Zmierzone i prognozowane całkowite obciążenie sieci belgijskiej (dane historyczne) (jsonld) @pl
description: Išmatuota ir prognozuojama bendra Belgijos tinklo apkrova (istoriniai duomenys) (jsonld) @lt
description: Mõõdetud ja prognoositav kogukoormus Belgia võrgus (ajaloolised andmed) (jsonld) @et
language: Engels
description: Izmerjena in napovedana skupna obremenitev belgijskega omrežja (zgodovinski podatki) (jsonld) @sl
description: Вимірюване та прогнозоване загальне навантаження на бельгійську мережу (Історичні дані) (jsonld) @uk
description: Carga total medida e prevista na rede belga (dados históricos) (jsonld) @pt
modified: 2026-05-29T08:58:42Z
issued: 2026-05-29T08:58:42Z
description: Tagħbija totali mkejla u mbassra fuq il-grilja Belġjana (Data storika) (jsonld) @mt
description: Μετρούμενο και προβλεπόμενο συνολικό φορτίο στο βελγικό δίκτυο (Ιστορικά δεδομένα) (jsonld) @el
description: Measured and forecasted total load on the Belgian grid (Historical data) (jsonld) @en
description: Carga total medida y prevista en la red belga (datos históricos) (jsonld) @es
description: Measured and forecasted total load on the Belgian grid (Geschichtliche Daten) (jsonld) @de
description: Izmērītā un prognozētā kopējā slodze Beļģijas tīklā (vēsturiskie dati) (jsonld) @lv
description: Målt og forventet samlet belastning på det belgiske net (historiske data) (jsonld) @da
description: Ualach iomlán tomhaiste agus tuartha ar ghreille na Beilge (Sonraí stairiúla) (jsonld) @ga
description: Uppmätt och prognostiserad total belastning på det belgiska rutnätet (historiska data) (jsonld) @sv
description: Izmjereno i predviđeno ukupno opterećenje na belgijskoj mreži (povijesni podaci) (jsonld) @hr
download URL: https://opendata.elia.be/api/explore/v2.1/catalog/datasets/ods001/exports/jsonld#
description: Sarcina totală măsurată și prognozată pe rețeaua belgiană (date istorice) (jsonld) @ro
description: Naměřené a předpokládané celkové zatížení belgické sítě (historické údaje) (jsonld) @cs
description: Gemeten en voorspelde totale belasting op het Belgische net (Historische gegevens) (jsonld)
description: A belga hálózat mért és előre jelzett teljes terhelése (történelmi adatok) (jsonld) @hu
description: Измерен и прогнозен общ товар на белгийската електроенергийна мрежа (исторически данни) (jsonld) @bg
description: Belgian verkon mitattu ja ennustettu kokonaiskuormitus (historialliset tiedot) (jsonld) @fi
format: JSON-LD
availability: AVAILABLE

JSON-LD
type: MediaTypeOrExtent
type: Concept
in scheme: file-type

openbaar
type: Concept
preferred label: public @fr
preferred label: without conditions @fr
in scheme: access-right
preferred label: Toegang zonder voorwaarden
type: RightsStatement
preferred label: öffentlich @de
preferred label: publiek
preferred label: publicly available @en
preferred label: Public @en

ods001.ttl
type: Distribution
description: Вимірюване та прогнозоване загальне навантаження на бельгійську мережу (Історичні дані) (черепаха) @uk
description: Измерено и прогнозирано общо натоварване на белгийската мрежа (исторически данни) (костенурка) @bg
description: Carga total medida y prevista en la red belga (datos históricos) (tortuga) @es
description: Carico totale misurato e previsto sulla rete belga (dati storici) (tartaruga) @it
download URL: https://opendata.elia.be/api/explore/v2.1/catalog/datasets/ods001/exports/turtle#
description: Izmērītā un prognozētā kopējā slodze Beļģijas tīklā (vēsturiskie dati) (bruņurupucis) @lv
access URL: https://opendata.elia.be/explore/dataset/ods001/information/
description: Measured and forecasted total load on the Belgian grid (Historische Daten) (Turtle) @de
description: Mõõdetud ja prognoositav kogukoormus Belgia võrgus (ajaloolised andmed) (kilpkonn) @et
description: Izmerjena in napovedana skupna obremenitev belgijskega omrežja (zgodovinski podatki) (želva) @sl
description: Uppmätt och prognostiserad total belastning på det belgiska rutnätet (historiska data) (sköldpadda) @sv
description: Izmjereno i predviđeno ukupno opterećenje na belgijskoj mreži (povijesni podaci) (kornjača) @hr
description: Measured and forecasted total load on the Belgian grid (Historical data) (turtle) @en
description: A belga hálózat mért és előre jelzett teljes terhelése (történelmi adatok) (teknős) @hu
language: Engels
issued: 2026-05-29T08:58:42Z
description: Ualach iomlán tomhaiste agus tuartha ar ghreille na Beilge (Sonraí stairiúla) (turtar) @ga
description: Zmierzone i prognozowane całkowite obciążenie sieci belgijskiej (dane historyczne) (żółw) @pl
description: Sarcina totală măsurată și prognozată pe grila belgiană (date istorice) (țestoasă) @ro
availability: AVAILABLE
description: Belgian verkon mitattu ja ennustettu kokonaiskuormitus (historialliset tiedot) (kilpikonna) @fi
description: Naměřené a předpokládané celkové zatížení belgické sítě (historické údaje) (želva) @cs
description: Gemeten en voorspelde totale belasting op het Belgische net (Historische gegevens) (schildpad)
license: Elia Open Data License
description: Išmatuota ir prognozuojama bendra Belgijos tinklo apkrova (istoriniai duomenys) (vėžlys) @lt
description: Tagħbija totali mkejla u mbassra fuq il-grilja Belġjana (Data storika) (fekruna) @mt
media type: text/turtle
format: TTL
description: Namerané a predpokladané celkové zaťaženie belgickej siete (historické údaje) (korytnačka) @sk
description: Målt og forventet samlet belastning på det belgiske net (historiske data) (skildpadde) @da
description: Carga total medida e prevista na rede belga (dados históricos) (tartartaruga) @pt
description: Μετρούμενο και προβλεπόμενο συνολικό φορτίο στο βελγικό δίκτυο (ιστορικά δεδομένα) (χελώνα) @el
modified: 2026-05-29T08:58:42Z

text/turtle
type: Concept
in scheme: media-types
type: MediaType

TTL
type: MediaTypeOrExtent
type: Concept
in scheme: file-type
preferred label: RDF Turtle

ods001.jsonl
type: Distribution
description: Izmerjena in napovedana skupna obremenitev belgijskega omrežja (zgodovinski podatki) (jsonl) @sl
description: Belgian verkon mitattu ja ennustettu kokonaiskuormitus (historialliset tiedot) (jsonl) @fi
description: Carico totale misurato e previsto sulla rete belga (dati storici) (jsonl) @it
description: Gemeten en voorspelde totale belasting op het Belgische net (Historische gegevens) (jsonl)
description: Izmjereno i predviđeno ukupno opterećenje na belgijskoj mreži (povijesni podaci) (jsonl) @hr
availability: AVAILABLE
description: Namerané a predpokladané celkové zaťaženie belgickej rozvodnej siete (historické údaje) (jsonl) @sk
language: Engels
description: Μετρούμενο και προβλεπόμενο συνολικό φορτίο στο βελγικό δίκτυο (Ιστορικά δεδομένα) (jsonl) @el
description: Izmērītā un prognozētā kopējā slodze Beļģijas tīklā (vēsturiskie dati) (jsonl) @lv
issued: 2026-05-29T08:58:42Z
description: Carga total medida e prevista na rede belga (dados históricos) (jsonl) @pt
license: Elia Open Data License
description: Ualach iomlán tomhaiste agus tuartha ar ghreille na Beilge (Sonraí stairiúla) (jsonl) @ga
description: Измерен и прогнозен общ товар на белгийската електроенергийна мрежа (исторически данни) (jsonl) @bg
description: Målt og forventet samlet belastning på det belgiske net (historiske data) (jsonl) @da
description: Išmatuota ir prognozuojama bendra Belgijos tinklo apkrova (istoriniai duomenys) (jsonl) @lt
description: Measured and forecasted total load on the Belgian grid (Historical data) (jsonl) @en
download URL: https://opendata.elia.be/api/explore/v2.1/catalog/datasets/ods001/exports/jsonl#
description: Zmierzone i prognozowane całkowite obciążenie sieci belgijskiej (dane historyczne) (jsonl) @pl
description: Naměřené a předpokládané celkové zatížení belgické sítě (historické údaje) (jsonl) @cs
description: Mõõdetud ja prognoositav kogukoormus Belgia võrgus (ajaloolised andmed) (jsonl) @et
format: JSON
description: Tagħbija totali mkejla u mbassra fuq il-grilja Belġjana (Data storika) (jsonl) @mt
description: Uppmätt och prognostiserad total belastning på det belgiska rutnätet (historiska data) (jsonl) @sv
description: Measured and forecasted total load on the Belgian grid (Geschichtliche Daten) (jsonl) @de
modified: 2026-05-29T08:58:42Z
description: Sarcina totală măsurată și prognozată pe rețeaua belgiană (date istorice) (jsonl) @ro
media type: application/json
access URL: https://opendata.elia.be/explore/dataset/ods001/information/
description: Вимірюване та прогнозоване загальне навантаження на бельгійську мережу (Історичні дані) (jsonl) @uk
description: A belga hálózat mért és előre jelzett teljes terhelése (történelmi adatok) (jsonl) @hu
description: Carga total medida y prevista en la red belga (datos históricos) (jsonl) @es

ods001.csv
type: Distribution
download URL: https://opendata.elia.be/api/explore/v2.1/catalog/datasets/ods001/exports/csv#
description: Išmatuota ir prognozuojama bendra Belgijos tinklo apkrova (istoriniai duomenys) (csv) @lt
description: Mõõdetud ja prognoositav kogukoormus Belgia võrgus (ajaloolised andmed) (csv) @et
language: Engels
format: CSV
description: Målt og forventet samlet belastning på det belgiske net (historiske data) (csv) @da
description: Belgian verkon mitattu ja ennustettu kokonaiskuormitus (historialliset tiedot) (csv) @fi
description: Carga total medida e prevista na rede belga (dados históricos) (csv) @pt
description: Izmerjena in napovedana skupna obremenitev belgijskega omrežja (zgodovinski podatki) (csv) @sl
description: Measured and forecasted total load on the Belgian grid (Historical data) (csv) @en
description: Gemeten en voorspelde totale belasting op het Belgische net (Historische gegevens) (csv)
description: Carico totale misurato e previsto sulla rete belga (dati storici) (csv) @it
issued: 2026-05-29T08:58:42Z
description: Вимірюване та прогнозоване загальне навантаження на бельгійську мережу (Історичні дані) (csv) @uk
media type: text/csv
description: Tagħbija totali mkejla u mbassra fuq il-grilja Belġjana (Data storika) (csv) @mt
description: Ualach iomlán tomhaiste agus tuartha ar ghreille na Beilge (Sonraí stairiúla) (csv) @ga
description: Sarcina totală măsurată și prognozată pe grila belgiană (date istorice) (csv) @ro
license: Elia Open Data License
description: A belga hálózat mért és előre jelzett teljes terhelése (történelmi adatok) (csv) @hu
description: Izmērītā un prognozētā kopējā slodze Beļģijas tīklā (vēsturiskie dati) (csv) @lv
description: Naměřené a předpokládané celkové zatížení belgické sítě (historické údaje) (csv) @cs
availability: AVAILABLE
description: Namerané a predpokladané celkové zaťaženie belgickej rozvodnej siete (historické údaje) (csv) @sk
description: Izmjereno i predviđeno ukupno opterećenje na belgijskoj mreži (povijesni podaci) (csv) @hr
description: Zmierzone i prognozowane całkowite obciążenie sieci belgijskiej (dane historyczne) (csv) @pl
description: Измерен и прогнозен общ товар на белгийската електроенергийна мрежа (исторически данни) (csv) @bg
description: Measured and forecasted total load on the Belgian grid (Historische Daten) (csv) @de
access URL: https://opendata.elia.be/explore/dataset/ods001/information/
description: Μετρούμενο και προβλεπόμενο συνολικό φορτίο στο βελγικό δίκτυο (Ιστορικά δεδομένα) (csv) @el
description: Uppmätt och prognostiserad total belastning på det belgiska rutnätet (historiska data) (csv) @sv
description: Carga total medida y prevista en la red belga (datos históricos) (csv) @es
modified: 2026-05-29T08:58:42Z

CSV
type: MediaTypeOrExtent
type: Concept
in scheme: file-type

text/csv
type: MediaType
in scheme: media-types
type: Concept