Schatting en prognose van de fotovoltaïsche elektriciteitsproductie op het Belgische elektriciteitsnet (historisch)
type: Dataset
description: Gemeten en opgeschaalde fotovoltaïsche energieopwekking op het Belgische net.Houd er rekening mee dat de gemeten en voorspelde waarden in MW zijn, het is de verantwoordelijkheid van de gebruikers om de waarden als zodanig te interpreteren.
description: Mitattu ja laajennettu aurinkosähkön tuotanto Belgian verkossa.Huomaa, että mitatut ja ennustetut arvot ovat megawatteina, on käyttäjien vastuulla tulkita arvot sellaisiksi. @fi
modified: 2026-05-29T03:50:50Z
description: Zmierzona i zwiększona produkcja energii fotowoltaicznej w sieci belgijskiej.Należy zauważyć, że wartości mierzone i prognozowane są w MW, a odpowiedzialność za interpretację wartości jako takich spoczywa na użytkownikach. @pl
title: Schatting en prognose van de fotovoltaïsche elektriciteitsproductie op het Belgische elektriciteitsnet (historisch) - opinie, recenzje użytkowników, ekspertów, porównanie cen. - alaTest.pl @pl
description: Μετρηθείσα και αναβαθμισθείσα παραγωγή φωτοβολταϊκής ενέργειας στο βελγικό δίκτυο. Επισημαίνεται ότι οι μετρηθείσες και προβλεπόμενες τιμές είναι σε MW, είναι ευθύνη των χρηστών να ερμηνεύουν τις τιμές ως τέτοιες. @el
title: Estimation et prévision de la production d'énergie photovoltaïque sur le réseau belge (Historique) @fr
title: Schatting en prognose van de fotovoltaïsche elektriciteitsproductie op het Belgische elektriciteitsnet (historisch) (inte översatt till svenska) @sv
title: Schatting en prognose van de fotovoltaïsche elektriciteitsproductie op het Belgische elektriciteitsnet (historisch) Systémové požadavky @cs
description: Išmatuota ir padidinta fotovoltinės energijos gamyba Belgijos tinkle.Atkreipkite dėmesį į tai, kad išmatuotos ir prognozuojamos vertės yra MW, naudotojai yra atsakingi už pačių verčių aiškinimą. @lt
description: Вимірювана та вдосконалена фотоелектрична генерація електроенергії в бельгійській мережі.Зверніть увагу, що виміряні та прогнозні значення знаходяться в МВт, користувачі несуть відповідальність за інтерпретацію значень як таких. @uk
description: Generarea de energie fotovoltaică măsurată și extinsă în rețeaua belgiană.Vă rugăm să rețineți că valorile măsurate și prognozate sunt exprimate în MW, iar utilizatorilor le revine responsabilitatea de a interpreta valorile ca atare. @ro
description: Gemessene und gehobene Photovoltaik-Stromerzeugung im belgischen Netz.Bitte beachten Sie, dass die gemessenen und prognostizierten Werte in MW sind, es liegt in der Verantwortung der Nutzer, die Werte als solche zu interpretieren. @de
description: Measured and upscaled photovoltaic power generation on the Belgian grid.Please note that the measured and forecast values are in MW, it is of the users responsibility to interpret the values as such. @en
title: Photovoltaic power production estimation and forecast on Belgian grid (Historical) @en
description: Giniúint cumhachta fótavoltaí tomhaiste agus uas-scálaithe ar eangach na Beilge.Tabhair faoi deara go bhfuil na luachanna tomhaiste agus réamhaisnéise in MW, is ar na húsáideoirí atá an fhreagracht na luachanna a léirmhíniú mar sin. @ga
contact point: Kind
  fn: Elia
description: Generazione di energia fotovoltaica misurata e potenziata sulla rete belga.Si noti che i valori misurati e previsti sono in MW, è responsabilità degli utenti interpretare i valori in quanto tali. @it
title: Schatting en prognose van de fotovoltaïsche elektriciteitsproductie op het Belgische elektriciteitsnet (stairisch) @ga
description: Izmērītā un palielinātā fotoelementu elektroenerģijas ražošana Beļģijas tīklā.Lūdzu, ņemiet vērā, ka izmērītās un prognozētās vērtības ir izteiktas MW, lietotāju pienākums ir interpretēt vērtības kā tādas. @lv
access rights: openbaar
publisher: Elia
accrual periodicity: dagelijks
description: Измерено и увеличено производство на фотоволтаична енергия в белгийската мрежа.Моля, имайте предвид, че измерените и прогнозните стойности са в MW, отговорност на потребителите е да тълкуват стойностите като такива. @bg
description: Izmjerena i poboljšana proizvodnja fotonaponske energije u belgijskoj mreži.Imajte na umu da su izmjerene i predviđene vrijednosti izražene u MW, a korisnici su odgovorni za tumačenje vrijednosti kao takvih. @hr
theme: Energie
description: Nameraná a rozšírená výroba fotovoltickej energie v belgickej rozvodnej sieti.Upozorňujeme, že namerané a predpokladané hodnoty sú v MW, za interpretáciu hodnôt ako takých sú zodpovední používatelia. @sk
title: Schatting en prognose van de fotovoltaïsche elektriciteitsproductie op het Belgische elektriciteitsnet (historisch) Sistēmas Prasības @lv
keyword: Photovoltaic @en
description: Naměřená a rozšířená výroba fotovoltaické energie v belgické rozvodné síti.Upozorňujeme, že naměřené a předpokládané hodnoty jsou v MW, za interpretaci hodnot jako takových jsou odpovědní uživatelé. @cs
description: Mõõdetud ja suurendatud fotogalvaanilise energia tootmine Belgia võrgus.Pange tähele, et mõõdetud ja prognoositud väärtused on esitatud megavattides, väärtuste tõlgendamine on kasutajate ülesanne. @et
description: Production d'énergie photovoltaïque mesurée et augmentée sur le réseau belge.Veuillez noter que les valeurs mesurées et prévues sont en MW, il est de la responsabilité des utilisateurs d'interpréter les valeurs en tant que telles. @fr
description: Målt og opskaleret fotovoltaisk elproduktion på det belgiske net.Bemærk, at de målte og forventede værdier er i MW, det er brugernes ansvar at fortolke værdierne som sådan. @da
title: Schatting en prognose van de fotovoltaïsche elektriciteitsproductie op het Belgische elektriciteitsnet (testo e traduzione) @it
description: Produção de energia fotovoltaica medida e melhorada na rede belga. Note-se que os valores medidos e previstos são em MW, sendo da responsabilidade dos utilizadores interpretar os valores como tal. @pt
keyword: Forecast @en
description: Izmerjena in povečana proizvodnja fotovoltaične energije v belgijskem omrežju.Upoštevajte, da so izmerjene in napovedane vrednosti v MW, uporabniki pa so odgovorni za razlago vrednosti kot takih. @sl
description: Mért és felskálázott fotovoltaikus energiatermelés a belga hálózaton.Kérjük, vegye figyelembe, hogy a mért és előrejelzett értékek MW-ban vannak megadva, az értékek ilyenként való értelmezése a felhasználók felelőssége. @hu
subject: https://opendata.elia.be/explore/
title: Schätzung und Prognose der Photovoltaik-Stromproduktion auf dem belgischen Netz (Historisch) @de
description: Generación de energía fotovoltaica medida y mejorada en la red belga.Tenga en cuenta que los valores medidos y previstos están en MW, es responsabilidad de los usuarios interpretar los valores como tales. @es
description: Ġenerazzjoni tal-enerġija fotovoltajka mkejla u mtejba fuq il-grilja Belġjana.Jekk jogħġbok innota li l-valuri mkejla u mbassra huma f’MW, hija r-responsabbiltà tal-utenti li jinterpretaw il-valuri bħala tali. @mt
language: Engels
spatial: Belgium
title: Schatting en prognose van de fotovoltaïsche elektriciteitsproductie op het Belgische elektriciteitsnet (historisch) (în limba engleză) @ro
title: Schatting en prognose van de fotovoltaïsche elektriciteitsproductie op het Belgische elektriciteitsnet (ιστορικό) @el
title: Schatting en prognose van de fotovoltaïsche elektriciteitsproductie op het Belgische elektriciteitsnet (исторически) @bg
issued: 2026-05-29T03:50:50Z
description: Uppmätt och utökad solcellsproduktion på det belgiska nätet.Observera att de uppmätta och prognostiserade värdena är i MW, det är användarnas ansvar att tolka värdena som sådana. @sv
landing page: https://opendata.elia.be/explore/dataset/ods032/information/

ods032.ttl
type: Distribution
description: Stima u tbassir tal-produzzjoni tal-enerġija fotovoltajka fuq il-grilja Belġjana (Storika) (fekruna) @mt
description: Uppskattning och prognos för solcellsproduktionen på det belgiska elnätet (historiskt) (sköldpadda) @sv
description: Szacunki i prognozy dotyczące produkcji energii fotowoltaicznej w sieci belgijskiej (historyczne) (żółw) @pl
description: Ocena in napoved proizvodnje fotovoltaične energije na belgijskem omrežju (zgodovinsko) (želva) @sl
description: Оцінка та прогноз виробництва фотоелектричної енергії в бельгійській мережі (історична) (черепаха) @uk
availability: AVAILABLE
description: Fotoelektros energijos gamybos Belgijos tinkle apskaičiavimas ir prognozė (istorinė) (vėžlys) @lt
description: Skøn over og prognose for produktionen af solcelleenergi på det belgiske net (historisk) (skildpadde) @da
format: TTL
description: Photovoltaic power production estimation and forecast on Belgian grid (Historical) (turtle) @en
media type: text/turtle
language: Engels
description: Odhad a prognóza výroby fotovoltickej energie v belgickej rozvodnej sieti (historická) (korytnačka) @sk
modified: 2026-05-29T03:50:50Z
description: Estimativa e previsão da produção de energia fotovoltaica na rede belga (histórica) (tartaruga) @pt
description: Stima e previsione della produzione di energia fotovoltaica sulla rete belga (storica) (tartaruga) @it
description: Fotoelementu enerģijas ražošanas aplēse un prognoze Beļģijas tīklā (vēsturisks) (bruņurupucis) @lv
description: Оценка и прогноза за производството на фотоволтаична енергия в белгийската мрежа (историческа) (костенурка) @bg
description: A fotovoltaikus energiatermelés becslése és előrejelzése a belga hálózaton (történelmi) (teknős) @hu
description: Estimación y previsión de la producción de energía fotovoltaica en la red eléctrica belga (histórica) (tortuga) @es
description: Photovoltaic power production schätze and forecast on Belgian grid (Historisch) (Turtle) @de
access URL: https://opendata.elia.be/explore/dataset/ods032/information/
license: Elia Open Data License
description: Estimarea și prognoza producției de energie fotovoltaică pe rețeaua belgiană (istorică) (țestoasă) @ro
description: Procjena i predviđanje proizvodnje fotonaponske energije na belgijskoj mreži (povijesno) (kornjača) @hr
issued: 2026-05-29T03:50:50Z
description: Meastachán ar tháirgeadh cumhachta fótavoltaí agus réamhaisnéis ar eangach na Beilge (Stairiúil) (turtar) @ga
download URL: https://opendata.elia.be/api/explore/v2.1/catalog/datasets/ods032/exports/turtle#
description: Fotogalvaanilise energia tootmise hinnang ja prognoos Belgia elektrivõrgu kohta (ajalooline) (kilpkonn) @et
description: Odhad a prognóza výroby fotovoltaické energie v belgické síti (historické) (želva) @cs
description: Εκτίμηση και πρόβλεψη της παραγωγής φωτοβολταϊκής ενέργειας στο βελγικό δίκτυο (ιστορικό) (χελώνα) @el
description: Aurinkosähkön tuotannon arviointi ja ennuste Belgian sähköverkossa (historiallinen) (kilpikonna) @fi
description: Schatting en prognose van de fotovoltaïsche energieproductie op het Belgische net (historisch) (schildpad)

TTL
type: MediaTypeOrExtent
type: Concept
in scheme: file-type
preferred label: RDF Turtle

text/turtle
type: Concept
in scheme: media-types
type: MediaType

Engels
type: LinguisticSystem
preferred label: English @en
preferred label: anglais @fr
in scheme: language
preferred label: Anglais @fr
type: Concept
preferred label: Englisch @de

Elia Open Data License
type: LicenseDocument
type: Naamsvermelding

Naamsvermelding
type: Concept
preferred label: Attribution
in scheme: http://purl.org/adms/licencetype/1.0
notation: Attribution
type: LicenseDocument
preferred label: Verplichte bronvermelding

ods032.jsonld
type: Distribution
description: Odhad a prognóza výroby fotovoltaické energie v belgické síti (historický) (jsonld) @cs
description: Estimarea și prognoza producției de energie fotovoltaică pe rețeaua belgiană (istorică) (jsonld) @ro
description: Estimación y previsión de la producción de energía fotovoltaica en la red eléctrica belga (Histórica) (jsonld) @es
license: Elia Open Data License
title: Ods032.jsonld @pl
download URL: https://opendata.elia.be/api/explore/v2.1/catalog/datasets/ods032/exports/jsonld#
description: Ocena in napoved proizvodnje fotovoltaične energije na belgijskem omrežju (zgodovinsko) (jsonld) @sl
description: Photovoltaic power production estimation and forecast on Belgian grid (Historical) (jsonld) @en
modified: 2026-05-29T03:50:50Z
description: Uppskattning och prognos för solcellsproduktionen på det belgiska elnätet (Historical) (jsonld) @sv
description: Оцінка та прогноз виробництва фотоелектричної енергії в бельгійській мережі (історична) (jsonld) @uk
description: Stima u tbassir tal-produzzjoni tal-enerġija fotovoltajka fuq il-grilja Belġjana (Storika) (jsonld) @mt
description: Schatting en voorspelling van de fotovoltaïsche energieproductie op het Belgische net (Historisch) (jsonld)
description: Meastachán ar tháirgeadh cumhachta fótavoltaí agus réamhaisnéis ar ghreille na Beilge (Stairiúil) (jsonld) @ga
access URL: https://opendata.elia.be/explore/dataset/ods032/information/
media type: ld+json
description: Εκτίμηση και πρόβλεψη της παραγωγής φωτοβολταϊκής ενέργειας στο βελγικό δίκτυο (Ιστορικό) (jsonld) @el
description: Estimativa e previsão da produção de energia fotovoltaica na rede belga (Historical) (jsonld) @pt
description: Photovoltaic power production schätzung and forecast on Belgian grid (Historisch) (jsonld) @de
description: Procjena i predviđanje proizvodnje fotonaponske energije na belgijskoj mreži (povijesno) (jsonld) @hr
description: Fotoelementu enerģijas ražošanas aplēse un prognoze Beļģijas tīklā (vēsturisks) (jsonld) @lv
issued: 2026-05-29T03:50:50Z
description: Stima e previsione della produzione di energia fotovoltaica sulla rete belga (storica) (jsonld) @it
description: A fotovoltaikus energiatermelés becslése és előrejelzése a belga hálózaton (történelmi) (jsonld) @hu
language: Engels
description: Fotogalvaanilise energia tootmise hinnang ja prognoos Belgia elektrivõrgu kohta (ajalooline) (jsonld) @et
description: Odhad a prognóza výroby fotovoltickej energie v belgickej rozvodnej sieti (historická) (jsonld) @sk
description: Aurinkosähkön tuotannon arviointi ja ennuste Belgian sähköverkossa (Historical) (jsonld) @fi
description: Szacunki i prognozy dotyczące produkcji energii fotowoltaicznej w sieci belgijskiej (historyczne) (jsonld) @pl
description: Fotoelektros energijos gamybos Belgijos tinkle apskaičiavimas ir prognozė (istorinė) (jsonld) @lt
availability: AVAILABLE
format: JSON-LD
description: Оценка и прогноза за производството на фотоволтаична енергия в белгийската мрежа (историческа) (jsonld) @bg
description: Skøn over og prognose for produktionen af solcelleenergi på det belgiske net (historisk) (jsonld) @da

JSON-LD
type: MediaTypeOrExtent
type: Concept
in scheme: file-type

ods032.n3
type: Distribution
description: Estimación y previsión de la producción de energía fotovoltaica en la red eléctrica belga (histórica) (n3) @es
description: Fotovoltinės energijos gamybos Belgijos tinkle apskaičiavimas ir prognozė (istorinė) (n3) @lt
description: Estimativa e previsão da produção de energia fotovoltaica na rede belga (Historical) (n3) @pt
description: Skøn over og prognose for produktionen af solcelleenergi på det belgiske net (historisk) (n3) @da
description: Szacunki i prognozy dotyczące produkcji energii fotowoltaicznej w sieci belgijskiej (historyczne) (n3) @pl
description: Meastachán ar tháirgeadh cumhachta fótavoltaí agus réamhaisnéis ar eangach na Beilge (Stairiúil) (n3) @ga
description: Schatting en prognose van de fotovoltaïsche energieproductie op het Belgische net (historisch) (n3)
description: A fotovoltaikus energiatermelés becslése és előrejelzése a belga hálózaton (történelmi) (n3) @hu
description: Photovoltaic power production schätzung and forecast on Belgian grid (Historical) (n3) @de
format: N3
availability: AVAILABLE
license: Elia Open Data License
description: Stima e previsione della produzione di energia fotovoltaica sulla rete belga (storica) (n3) @it
issued: 2026-05-29T03:50:50Z
description: Aurinkosähkön tuotannon arviointi ja ennuste Belgian sähköverkossa (historiallinen) (n3) @fi
title: koefitsiendid 032.n3 @et
description: Odhad a prognóza výroby fotovoltickej energie v belgickej rozvodnej sieti (historická) (n3) @sk
description: Оценка и прогноза за производството на фотоволтаична енергия в белгийската мрежа (историческа) (n3) @bg
language: Engels
description: Odhad a prognóza výroby fotovoltaické energie v belgické síti (historické) (n3) @cs
description: Fotogalvaanilise energia tootmise hinnang ja prognoos Belgia elektrivõrgu kohta (ajalooline) (n3) @et
description: Fotoelementu enerģijas ražošanas aplēse un prognoze Beļģijas tīklā (vēsturisks) (n3) @lv
access URL: https://opendata.elia.be/explore/dataset/ods032/information/
description: Оцінка та прогноз виробництва фотоелектричної енергії в бельгійській електромережі (Історична) (n3) @uk
description: Uppskattning och prognos för solcellsproduktionen på det belgiska elnätet (historiskt) (n3) @sv
description: Procjena i predviđanje proizvodnje fotonaponske energije na belgijskoj mreži (povijesno) (n3) @hr
description: Stima u tbassir tal-produzzjoni tal-enerġija fotovoltajka fuq il-grilja Belġjana (Storika) (n3) @mt
description: Ocena in napoved proizvodnje fotovoltaične energije na belgijskem omrežju (zgodovinsko) (n3) @sl
description: Photovoltaic power production estimation and forecast on Belgian grid (Historical) (n3) @en
modified: 2026-05-29T03:50:50Z
description: Εκτίμηση και πρόβλεψη της παραγωγής φωτοβολταϊκής ενέργειας στο βελγικό δίκτυο (Ιστορικό) (n3) @el
download URL: https://opendata.elia.be/api/explore/v2.1/catalog/datasets/ods032/exports/n3#
description: Estimarea și prognoza producției de energie fotovoltaică pe rețeaua belgiană (istorică) (n3) @ro
media type: https://www.iana.org/assignments/media-types/text/n3

N3
type: Concept
in scheme: file-type
type: MediaTypeOrExtent

ods032.parket
type: Distribution
description: Odhad a prognóza výroby fotovoltaické energie v belgické síti (historický) @cs
description: Szacunki i prognozy dotyczące produkcji energii fotowoltaicznej w sieci belgijskiej (historyczne) @pl
description: A fotovoltaikus energiatermelés becslése és előrejelzése a belga hálózaton (történelmi) @hu
access URL: https://opendata.elia.be/explore/dataset/ods032/information/
description: Photovoltaic power production estimation and forecast on Belgian grid (Historical) (parquet) @en
description: Stima e previsione della produzione di energia fotovoltaica sulla rete belga (storica) @it
title: ods032.parkett @sv
description: Fotoelementu enerģijas ražošanas aplēse un prognoze Beļģijas tīklā (vēsturisks) @lv
description: Εκτίμηση και πρόβλεψη της παραγωγής φωτοβολταϊκής ενέργειας στο βελγικό δίκτυο (ιστορική) @el
description: Photovoltaic power production schätze and forecast on Belgian grid (Historical) (Staatsanwaltschaft) @de
language: Engels
modified: 2026-05-29T03:50:50Z
description: Skøn over og prognose for produktionen af solcelleenergi på det belgiske net (historisk) @da
download URL: https://opendata.elia.be/api/explore/v2.1/catalog/datasets/ods032/exports/parquet#
title: ods032.parquet @ga
title: ods032.паркет @bg
title: ods032. parkiet @pl
description: Fotoelektros energijos gamybos Belgijos tinkle apskaičiavimas ir prognozė (istorinė) @lt
description: Uppskattning och prognos för solcellsproduktionen på det belgiska elnätet (historiskt) @sv
title: ods032.parkety @sk
description: Estimativa e previsão da produção de energia fotovoltaica na rede belga (Historical) @pt
description: Odhad a prognóza výroby fotovoltickej energie v belgickej rozvodnej sieti (historická) @sk
availability: AVAILABLE
description: Оценка и прогноза за производството на фотоволтаична енергия в белгийската мрежа (историческа) @bg
issued: 2026-05-29T03:50:50Z
description: Stima u tbassir tal-produzzjoni tal-enerġija fotovoltajka fuq il-grilja Belġjana (Storika) @mt
license: Elia Open Data License
media type: parquet
title: ods032.parkets @lv
title: ods032.parketta @hu
title: ods032.parchet @ro
description: Оцінка та прогноз виробництва фотоелектричної енергії в бельгійській мережі (Історичний) @uk
description: Fotogalvaanilise energia tootmise hinnang ja prognoos Belgia elektrivõrgu kohta (ajalooline) @et
description: Estimación y previsión de la producción de energía fotovoltaica en la red eléctrica belga (Histórica) @es
description: Ocena in napoved proizvodnje fotovoltaične energije na belgijskem omrežju (zgodovinska) @sl
description: Estimarea și prognoza producției de energie fotovoltaică pe rețeaua belgiană (istorică) @ro
description: Procjena i predviđanje proizvodnje fotonaponske energije na belgijskoj mreži (povijesno) @hr
description: Schatting en voorspelling van de fotovoltaïsche energieproductie op het Belgische net (Historisch)
description: Meastachán ar tháirgeadh cumhachta fótavoltaí agus réamhaisnéis ar ghreille na Beilge (Stairiúil) @ga
format: Parquet
description: Aurinkosähkön tuotannon arviointi ja ennuste Belgian sähköverkossa (historiallinen) @fi
title: ods032.παρκέ @el

Parquet
type: Concept
in scheme: file-type
type: MediaTypeOrExtent

ods032.json
type: Distribution
description: Εκτίμηση και πρόβλεψη της παραγωγής φωτοβολταϊκής ενέργειας στο βελγικό δίκτυο (ιστορικό) (json) @el
description: Stima e previsione della produzione di energia fotovoltaica sulla rete belga (storica) (json) @it
format: JSON
description: Estimarea și prognoza producției de energie fotovoltaică pe rețeaua belgiană (istorică) (json) @ro
description: Photovoltaic power production estimation and forecast on Belgian grid (Historical) (json) @en
description: Uppskattning och prognos för solcellsproduktionen på det belgiska elnätet (Historical) (json) @sv
description: Odhad a prognóza výroby fotovoltaické energie v belgické síti (historický) (json) @cs
description: Odhad a prognóza výroby fotovoltickej energie v belgickej rozvodnej sieti (Historical) (json) @sk
description: Meastachán ar tháirgeadh cumhachta fótavoltaí agus réamhaisnéis ar ghreille na Beilge (Stairiúil) (json) @ga
description: Photovoltaic power production schätzung and forecast on Belgian grid (Historisch) (json) @de
description: Fotoelementu enerģijas ražošanas aplēse un prognoze Beļģijas tīklā (vēsturisks) (json) @lv
description: Aurinkosähkön tuotannon arviointi ja ennuste Belgian sähköverkossa (historiallinen) (json) @fi
license: Elia Open Data License
title: ods032.ισον @el
language: Engels
description: Stima u tbassir tal-produzzjoni tal-enerġija fotovoltajka fuq il-grilja Belġjana (Storika) (json) @mt
description: Estimación y previsión de la producción de energía fotovoltaica en la red eléctrica belga (Histórica) (json) @es
access URL: https://opendata.elia.be/explore/dataset/ods032/information/
description: Оценка и прогноза за производството на фотоволтаична енергия в белгийската мрежа (историческа) (json) @bg
description: Ocena in napoved proizvodnje fotovoltaične energije na belgijskem omrežju (zgodovinsko) (json) @sl
description: Skøn over og prognose for produktionen af solcelleenergi på det belgiske net (historisk) (json) @da
media type: application/json
availability: AVAILABLE
title: Ods032.json @pl
description: Procjena i predviđanje proizvodnje fotonaponske energije na belgijskoj mreži (povijesno) (json) @hr
description: A fotovoltaikus energiatermelés becslése és előrejelzése a belga hálózaton (történelmi) (json) @hu
description: Szacunki i prognozy dotyczące produkcji energii fotowoltaicznej w sieci belgijskiej (historyczne) (json) @pl
description: Fotogalvaanilise energia tootmise hinnang ja prognoos Belgia võrgu kohta (ajalooline) (json) @et
download URL: https://opendata.elia.be/api/explore/v2.1/catalog/datasets/ods032/exports/json#
description: Estimativa e previsão da produção de energia fotovoltaica na rede belga (Historical) (json) @pt
description: Оцінка та прогноз виробництва фотоелектричної енергії в бельгійській електромережі (історичний) (json) @uk
description: Schatting en prognose van de fotovoltaïsche energieproductie op het Belgische net (historisch) (json)
issued: 2026-05-29T03:50:50Z
description: Fotoelektros energijos gamybos Belgijos tinkle apskaičiavimas ir prognozė (istorinė) (json) @lt
modified: 2026-05-29T03:50:50Z

JSON
type: MediaTypeOrExtent
type: Concept
in scheme: file-type

application/json
type: Concept
in scheme: media-types
type: MediaType

openbaar
type: Concept
preferred label: public @fr
preferred label: without conditions @fr
in scheme: access-right
preferred label: Toegang zonder voorwaarden
type: RightsStatement
preferred label: öffentlich @de
preferred label: publiek
preferred label: publicly available @en
preferred label: Public @en

Elia
type: Agent
type: Organization
type: Bedrijf

Bedrijf
type: Concept
preferred label: Company @en
in scheme: http://purl.org/adms/publishertype/1.0

ods032.csv
type: Distribution
description: Estimativa e previsão da produção de energia fotovoltaica na rede belga (histórica) (csv) @pt
description: Odhad a prognóza výroby fotovoltickej energie v belgickej sieti (historická) (csv) @sk
description: Estimarea și prognoza producției de energie fotovoltaică pe rețeaua belgiană (istorică) (csv) @ro
availability: AVAILABLE
description: Fotoelementu enerģijas ražošanas aplēse un prognoze Beļģijas tīklā (vēsturisks) (csv) @lv
media type: text/csv
description: Stima e previsione della produzione di energia fotovoltaica sulla rete belga (storica) (csv) @it
description: Photovoltaic power production schätze and forecast on Belgian grid (Historisch) (csv) @de
description: Fotoelektros energijos gamybos Belgijos tinkle apskaičiavimas ir prognozė (istorinė) (csv) @lt
description: Szacunki i prognozy dotyczące produkcji energii fotowoltaicznej w sieci belgijskiej (historyczne) (csv) @pl
description: Εκτίμηση και πρόβλεψη της παραγωγής φωτοβολταϊκής ενέργειας στο βελγικό δίκτυο (ιστορικό) (csv) @el
description: Оцінка та прогноз виробництва фотоелектричної енергії в бельгійській мережі (Історична) (csv) @uk
description: Fotogalvaanilise energia tootmise hinnang ja prognoos Belgia elektrivõrgu kohta (ajalooline) (csv) @et
description: Procjena i predviđanje proizvodnje fotonaponske energije na belgijskoj mreži (povijesno) (csv) @hr
language: Engels
description: Skøn over og prognose for produktionen af solcelleenergi på det belgiske net (historisk) (csv) @da
description: Meastachán ar tháirgeadh cumhachta fótavoltaí agus réamhaisnéis ar ghreille na Beilge (Stairiúil) (csv) @ga
description: Aurinkosähkön tuotannon arviointi ja ennuste Belgian sähköverkossa (historiallinen) (csv) @fi
description: Odhad a prognóza výroby fotovoltaické energie v belgické síti (historické) (csv) @cs
description: A fotovoltaikus energiatermelés becslése és előrejelzése a belga hálózaton (történelmi) (csv) @hu
description: Photovoltaic power production estimation and forecast on Belgian grid (Historical) (csv) @en
modified: 2026-05-29T03:50:50Z
license: Elia Open Data License
description: Оценка и прогноза за производството на фотоволтаична енергия в белгийската мрежа (историческа) (csv) @bg
description: Stima u tbassir tal-produzzjoni tal-enerġija fotovoltajka fuq il-grilja Belġjana (Storika) (csv) @mt
issued: 2026-05-29T03:50:50Z
description: Uppskattning och prognos för solcellsproduktionen på det belgiska elnätet (historiskt) (csv) @sv
download URL: https://opendata.elia.be/api/explore/v2.1/catalog/datasets/ods032/exports/csv#
access URL: https://opendata.elia.be/explore/dataset/ods032/information/
description: Ocena in napoved proizvodnje fotovoltaične energije na belgijskem omrežju (zgodovinsko) (csv) @sl
description: Estimación y previsión de la producción de energía fotovoltaica en la red eléctrica belga (historial) (csv) @es
format: CSV
description: Schatting en prognose van de fotovoltaïsche energieproductie op het Belgische net (historisch) (csv)

text/csv
type: MediaType
in scheme: media-types
type: Concept

CSV
type: MediaTypeOrExtent
type: Concept
in scheme: file-type

dagelijks
type: Frequency
in scheme: frequency
preferred label: täglich @de
preferred label: quotidien @fr
preferred label: daily @en
type: Concept

ods032.xlsx
type: Distribution
media type: application/vnd.openxmlformats-officedocument.spreadsheetml.sheet
issued: 2026-05-29T03:50:50Z
description: Meastachán ar tháirgeadh cumhachta fótavoltaí agus réamhaisnéis ar ghreille na Beilge (Stairiúil) (xlsx) @ga
availability: AVAILABLE
description: Estimativa e previsão da produção de energia fotovoltaica na rede belga (histórica) (xlsx) @pt
description: Estimación y previsión de la producción de energía fotovoltaica en la red eléctrica belga (Histórica) (xlsx) @es
description: A fotovoltaikus energiatermelés becslése és előrejelzése a belga hálózaton (történelmi) (xlsx) @hu
description: Photovoltaic power production schätze and forecast on Belgian grid (Historisch) (xlsx) @de
format: XLSX
description: Skøn over og prognose for produktionen af solcelleenergi på det belgiske net (historisk) (xlsx) @da
description: Schatting en voorspelling van de fotovoltaïsche energieproductie op het Belgische net (Historisch) (xlsx)
language: Engels
modified: 2026-05-29T03:50:50Z
description: Odhad a prognóza výroby fotovoltickej energie v belgickej sieti (historická) (xlsx) @sk
access URL: https://opendata.elia.be/explore/dataset/ods032/information/
description: Uppskattning och prognos för solcellsproduktionen på det belgiska elnätet (historiskt) (xlsx) @sv
description: Stima e previsione della produzione di energia fotovoltaica sulla rete belga (storica) (xlsx) @it
description: Stima u tbassir tal-produzzjoni tal-enerġija fotovoltajka fuq il-grilja Belġjana (Storika) (xlsx) @mt
download URL: https://opendata.elia.be/api/explore/v2.1/catalog/datasets/ods032/exports/xlsx#
description: Photovoltaic power production estimation and forecast on Belgian grid (Historical) (xlsx) @en
description: Szacunki i prognozy dotyczące produkcji energii fotowoltaicznej w sieci belgijskiej (historyczne) (xlsx) @pl
description: Fotogalvaanilise energia tootmise hinnang ja prognoos Belgia elektrivõrgu kohta (ajalooline) (xlsx) @et
description: Оценка и прогноза за производството на фотоволтаична енергия в белгийската мрежа (историческа) (xlsx) @bg
description: Εκτίμηση και πρόβλεψη της παραγωγής φωτοβολταϊκής ενέργειας στο βελγικό δίκτυο (Ιστορικό) (xlsx) @el
description: Fotoelementu enerģijas ražošanas aplēse un prognoze Beļģijas tīklā (vēsturisks) (xlsx) @lv
description: Aurinkosähkön tuotannon arviointi ja ennuste Belgian sähköverkossa (historiallinen) (xlsx) @fi
description: Ocena in napoved proizvodnje fotovoltaične energije na belgijskem omrežju (zgodovinsko) (xlsx) @sl
description: Procjena i predviđanje proizvodnje fotonaponske energije na belgijskoj mreži (povijesno) (xlsx) @hr
license: Elia Open Data License
description: Odhad a prognóza výroby fotovoltaické energie v belgické síti (historická) (xlsx) @cs
description: Fotoelektros energijos gamybos Belgijos tinkle apskaičiavimas ir prognozė (istorinė) (xlsx) @lt
description: Оцінка та прогноз виробництва фотоелектричної енергії в бельгійській електромережі (Historical) (xlsx) @uk
description: Estimarea și prognoza producției de energie fotovoltaică pe rețeaua belgiană (istorică) (xlsx) @ro

application/vnd.openxmlformats-officedocument.spreadsheetml.sheet
type: Concept
preferred label: XLSX
type: MediaType

XLSX
type: MediaTypeOrExtent
preferred label: Excel XLSX
type: Concept
in scheme: file-type

Energie
type: Concept
preferred label: Énergie @fr
in scheme: datatheme
preferred label: ENERGY @en
preferred label: Energy @en
in scheme: data-theme

ods032.rdf
type: Distribution
issued: 2026-05-29T03:50:50Z
description: Estimativa e previsão da produção de energia fotovoltaica na rede belga (Historical) (rdfxml) @pt
description: Estimarea și prognoza producției de energie fotovoltaică pe rețeaua belgiană (istorică) (rdfxml) @ro
description: Procjena i predviđanje proizvodnje fotonaponske energije na belgijskoj mreži (povijesno) (rdfxml) @hr
download URL: https://opendata.elia.be/api/explore/v2.1/catalog/datasets/ods032/exports/rdfxml#
description: Photovoltaic power production estimation and forecast on Belgian grid (Historical) (rdfxml) @en
description: Aurinkosähkön tuotannon arviointi ja ennuste Belgian sähköverkossa (historiallinen) (rdfxml) @fi
modified: 2026-05-29T03:50:50Z
description: Fotogalvaanilise energia tootmise hinnang ja prognoos Belgia võrgus (ajalooline) (rdfxml) @et
description: Ocena in napoved proizvodnje fotovoltaične energije na belgijskem omrežju (zgodovinsko) (rdfxml) @sl
description: Odhad a prognóza výroby fotovoltickej energie v belgickej rozvodnej sieti (Historical) (rdfxml) @sk
description: Stima u tbassir tal-produzzjoni tal-enerġija fotovoltajka fuq il-grilja Belġjana (Storika) (rdfxml) @mt
description: Uppskattning och prognos för solcellsproduktionen på det belgiska elnätet (Historical) (rdfxml) @sv
description: Odhad a předpověď výroby fotovoltaické energie v belgické síti (historické) (rdfxml) @cs
access URL: https://opendata.elia.be/explore/dataset/ods032/information/
description: Skøn over og prognose for produktionen af solcelleenergi på det belgiske net (historisk) (rdfxml) @da
format: RDF/XML
license: Elia Open Data License
description: Schatting en voorspelling van de fotovoltaïsche energieproductie op het Belgische net (Historisch) (rdfxml)
availability: AVAILABLE
description: Оцінка та прогноз виробництва фотоелектричної енергії в бельгійській мережі (Історична) (rdfxml) @uk
media type: rdf+xml
description: Meastachán ar tháirgeadh cumhachta fótavoltaí agus réamhaisnéis ar ghreille na Beilge (Stairiúil) (rdfxml) @ga
description: Estimación y previsión de la producción de energía fotovoltaica en la red eléctrica belga (Histórica) (rdfxml) @es
description: Oszacowanie i prognoza produkcji energii fotowoltaicznej na belgijskiej sieci (Historical) (rdfxml) @pl
description: Fotoelementu enerģijas ražošanas aplēse un prognoze Beļģijas tīklā (vēsturisks) (rdfxml) @lv
description: Εκτίμηση και πρόβλεψη της παραγωγής φωτοβολταϊκής ενέργειας στο βελγικό δίκτυο (Ιστορικό) (rdfxml) @el
language: Engels
description: Photovoltaic power production schätzung and forecast on Belgian grid (Historisch) (rdfxml) @de
description: Stima e previsione della produzione di energia fotovoltaica sulla rete belga (storica) (rdfxml) @it
description: Оценка и прогноза за производството на фотоволтаична енергия в белгийската мрежа (историческа) (rdfxml) @bg
description: A fotovoltaikus energiatermelés becslése és előrejelzése a belga hálózaton (történelmi) (rdfxml) @hu
description: Fotoelektros energijos gamybos Belgijos tinkle apskaičiavimas ir prognozė (istorinė) (rdfxml) @lt

RDF/XML
type: MediaTypeOrExtent
in scheme: file-type
type: Concept

Belgium
type: Location

ods032.jsonl
type: Distribution
description: Photovoltaic power production estimation and forecast on Belgian grid (Historical) (jsonl) @en
access URL: https://opendata.elia.be/explore/dataset/ods032/information/
description: Procjena i predviđanje proizvodnje fotonaponske energije na belgijskoj mreži (povijesno) (jsonl) @hr
media type: application/json
modified: 2026-05-29T03:50:50Z
description: Оценка и прогноза за производството на фотоволтаична енергия в белгийската мрежа (историческа) (jsonl) @bg
description: A fotovoltaikus energiatermelés becslése és előrejelzése a belga hálózaton (történelmi) (jsonl) @hu
issued: 2026-05-29T03:50:50Z
description: Fotoelektros energijos gamybos Belgijos tinkle apskaičiavimas ir prognozė (istorinė) (jsonl) @lt
description: Stima e previsione della produzione di energia fotovoltaica sulla rete belga (storica) (jsonl) @it
availability: AVAILABLE
description: Оцінка та прогноз виробництва фотоелектричної енергії в бельгійській мережі (історична) (jsonl) @uk
description: Aurinkosähkön tuotannon arviointi ja ennuste Belgian sähköverkossa (historiallinen) (jsonl) @fi
description: Szacunki i prognozy dotyczące produkcji energii fotowoltaicznej w sieci belgijskiej (historyczne) (jsonl) @pl
title: οδσ032.ισονλ @el
download URL: https://opendata.elia.be/api/explore/v2.1/catalog/datasets/ods032/exports/jsonl#
license: Elia Open Data License
description: Ocena in napoved proizvodnje fotovoltaične energije na belgijskem omrežju (zgodovinsko) (jsonl) @sl
description: Uppskattning och prognos för solcellsproduktionen på det belgiska elnätet (historiskt) (jsonl) @sv
description: Estimativa e previsão da produção de energia fotovoltaica na rede belga (Historical) (jsonl) @pt
description: Schatting en voorspelling van de fotovoltaïsche energieproductie op het Belgische net (Historisch) (jsonl)
description: Skøn over og prognose for produktionen af solcelleenergi på det belgiske net (historisk) (jsonl) @da
language: Engels
description: Odhad a prognóza výroby fotovoltaické energie v belgické síti (historický) (jsonl) @cs
description: Stima u tbassir tal-produzzjoni tal-enerġija fotovoltajka fuq il-grilja Belġjana (Storika) (jsonl) @mt
description: Fotogalvaanilise energia tootmise hinnang ja prognoos Belgia elektrivõrgu kohta (ajalooline) (jsonl) @et
description: Photovoltaic power production schätzung and forecast on Belgian grid (Historisch) (jsonl) @de
description: Εκτίμηση και πρόβλεψη της παραγωγής φωτοβολταϊκής ενέργειας στο βελγικό δίκτυο (Ιστορικό) (jsonl) @el
description: Estimación y previsión de la producción de energía fotovoltaica en la red eléctrica belga (Histórica) (jsonl) @es
description: Fotoelementu enerģijas ražošanas aplēse un prognoze Beļģijas tīklā (vēsturisks) (jsonl) @lv
description: Estimarea și prognoza producției de energie fotovoltaică pe rețeaua belgiană (istorică) (jsonl) @ro
description: Odhad a prognóza výroby fotovoltickej energie v belgickej rozvodnej sieti (historická) (jsonl) @sk
format: JSON
description: Meastachán ar tháirgeadh cumhachta fótavoltaí agus réamhaisnéis ar ghreille na Beilge (Stairiúil) (jsonl) @ga