Agromet
type: Dataset
description: The data made available are those of the 'Pameseb' network of CRA-W. The measures available concern: air temperature in °C (tsa), precipitation in mm (plu) , relative humidity in % (hra), sunshine in J/cm ² (ens), humectation of the foliage in nb min/hour (hct), wind speed at 2 metres in m/s (vvt) The data provided are of daily frequency. Hourly data are available on Agromet.be. Daily data (minimum, average, maximum or cumulation) are initially based on data recorded at 1-minute time step. The aggregation rules are as follows: "_min" Minimum hourly values between 1h UTC +1 and 0h UTC +1. "_avg" Average hourly values between 1h UTC +1 and 0h UTC +1. "_max" Maximum hourly values between 1h UTC +1 and 0h UTC +1. "_sum" Sum of hourly values from 1h UTC +1 to 0h UTC +1. @en
keyword: météo @fr
title: Агромет @bg
contributor: SPW CRA-W Centre wallon de Recherches agronomiques
description: De data, der stilles til rådighed, er data fra CRA-W's »Pameseb«-netværk. De foranstaltninger, der er til rådighed, vedrører: lufttemperatur i °C (tsa) nedbør i mm (plu) , relativ luftfugtighed i % (hra) solskin i J/cm ² (en), befugtning af løvet i nb min/time (hct) vindhastighed på 2 m i m/s (vvt) De angivne data er af daglig hyppighed. Timedata er tilgængelige på Agromet.be. Daglige data (minimum, gennemsnit, maksimum eller kumulation) baseres i første omgang på data, der registreres på tidstrinnet 1 minut. Reglerne for sammenlægning er som følger: "_min" Minimum timeværdier mellem 1h UTC +1 og 0h UTC +1. "_avg" Gennemsnitlige timeværdier mellem 1h UTC +1 og 0h UTC +1. "_max" Maksimale timeværdier mellem 1h UTC +1 og 0h UTC +1. "_sum" Summen af timeværdier fra 1h UTC +1 til 0h UTC +1. @da
description: Die bereitgestellten Daten stammen aus dem 'Pameseb'-Netz des CRA-W. Die verfügbaren Maßnahmen betreffen: Lufttemperatur in °C (tsa), Niederschlag in mm (plu) , relative Luftfeuchtigkeit in % (hra), Sonneneinstrahlung in J/cm² (ens), Befeuchtung des Laubs in nb min/Stunde (hct), Windgeschwindigkeit bei 2 Metern in m/s (vvt) Die angegebenen Daten sind täglich. Die stündlichen Daten finden Sie unter Agromet.be. Die täglichen Daten (Minimum, Durchschnitt, Maximum oder Kumulierung) basieren zunächst auf Daten, die im 1-Minuten-Schritt aufgezeichnet wurden. Die Aggregationsregeln lauten wie folgt: "_min" Minimum der stündlichen Werte zwischen 1h UTC +1 bis 0h UTC +1. "_avg" Durchschnitt der stündlichen Werte zwischen 1h UTC +1 bis 0h UTC +1. "_max" Maximale stündliche Werte zwischen 1h UTC +1 bis 0h UTC +1. "_sum" Summe der stündlichen Werte von 1h UTC +1 bis 0h UTC +1.. @de
description: Предоставените данни са тези от мрежата "Pameseb" на CRA-W. Наличните мерки се отнасят до: температура на въздуха в °C (tsa), валежи в mm (плу) , относителна влажност в % (hra), слънце в J/cm ² (ens), овлажняване на листата в nb min/час (hct), скорост на вятъра 2 метра в m/s (vvt) Предоставените данни са с ежедневна честота. Почасовите данни са достъпни на Agromet.be. Дневните данни (минимални, средни, максимални или кумулирани) първоначално се основават на данни, записани в рамките на 1 минута. Правилата за сумиране са следните: "_min" Минимални почасови стойности между 1h UTC +1 и 0h UTC +1. "_avg" Средни часови стойности между 1h UTC +1 и 0h UTC +1. "_max" Максимални часови стойности между 1h UTC +1 и 0h UTC +1. "_sum" Сума на почасовите стойности от 1h UTC +1 до 0h UTC +1. @bg
theme: Agriculture
temporal: PeriodOfTime
  start date: 2024-01-01T22:00:00Z
keyword: agriculture @fr
accrual periodicity: dagelijks
description: Id-data disponibbli hija dik tan-netwerk "Pameseb" tas-CRA-W. Il-miżuri disponibbli jikkonċernaw: it-temperatura ta' l-arja f' °C (tsa), preċipitazzjoni f'mm (plu) , l-umdità relattiva f'% (hra), xemx f'J/cm ² (ens), l-umettazzjoni tal-weraq f’nb min/siegħa (hct), veloċità tar-riħ ta’ 2 metri f’m/s (vvt) Id-data pprovduta hija ta’ frekwenza ta’ kuljum. Id-data fis-siegħa hija disponibbli fuq Agromet.be. Id-data ta’ kuljum (minimu, medju, massimu jew akkumulazzjoni) hija inizjalment ibbażata fuq data rreġistrata fi stadju ta’ ħin ta’ minuta. Ir-regoli ta’ aggregazzjoni huma kif ġej: "_min" Valuri minimi fis-siegħa bejn 1h UTC +1 u 0h UTC +1. "_avg" Valuri medji fis-siegħa bejn 1h UTC +1 u 0h UTC +1. "_max" Valuri massimi fis-siegħa bejn 1h UTC +1 u 0h UTC +1. "_sum" Somma tal-valuri fis-siegħa minn 1h UTC +1 sa 0h UTC +1. @mt
description: Pateikiami CRA-W tinklo „Pameseb“ duomenys. Galimos priemonės yra susijusios su: oro temperatūra °C (tsa), krituliai milimetrais (plu) , santykinis drėgnis % (hra), saulės spinduliai J/cm ² (ens), lapijos drėkinimas nb min/val. (hct), vėjo greitis 2 m/s (vvt) Pateikti duomenys yra kasdienio dažnumo. Valandiniai duomenys yra prieinami Agromet.be. Dienos duomenys (mažiausi, vidutiniai, didžiausi arba sumuojami) iš pradžių grindžiami duomenimis, užregistruotais per 1 minutės laiko tarpsnį. Sumavimo taisyklės yra tokios: "_min" Minimalios valandinės vertės nuo 1h UTC +1 iki 0h UTC +1. "_avg" Vidutinės valandinės vertės nuo 1h UTC +1 iki 0h UTC +1. "_max" Didžiausios valandinės vertės nuo 1h UTC +1 iki 0h UTC +1. "_sum" Valandinių verčių suma nuo 1h UTC +1 iki 0h UTC +1. @lt
description: Os dados disponibilizados são os da rede «Pameseb» da CRA-W. As medidas disponíveis dizem respeito: temperatura do ar em °C (tsa), precipitação em mm (plu) , humidade relativa em % (hra), a luz do sol em J/cm ² (ens), humectação da folhagem em nb min/hora (hct), velocidade do vento a 2 metros em m/s (vvt) Os dados fornecidos são de frequência diária. Os dados horários estão disponíveis em Agromet.be. Os dados diários (mínimo, médio, máximo ou acumulação) baseiam-se inicialmente em dados registados num intervalo de tempo de 1 minuto. As regras de agregação são as seguintes: "_min" Valores horários mínimos entre 1h UTC +1 e 0h UTC +1. "_avg" Média dos valores horários entre 1h UTC +1 e 0h UTC +1. "_max" Valores horários máximos entre 1h UTC +1 e 0h UTC +1. "_sum" Soma dos valores horários de 1h UTC +1 a 0h UTC +1. @pt
description: Τα διαθέσιμα δεδομένα είναι εκείνα του δικτύου «Pameseb» της CRA-W. Τα διαθέσιμα μέτρα αφορούν: θερμοκρασία του αέρα σε °C (tsa), κατακρήμνιση σε mm (plu) , σχετική υγρασία σε % (hra), ηλιοφάνεια σε J/cm ² (ens), ύγρανση του φυλλώματος σε nb min/ώρα (hct), ταχύτητα ανέμου στα 2 μέτρα σε m/s (vt) Τα στοιχεία που παρέχονται είναι καθημερινής συχνότητας. Τα δεδομένα ανά ώρα είναι διαθέσιμα στο Agromet.be. Τα ημερήσια δεδομένα (ελάχιστα, μέσα, μέγιστα ή σωρευτικά) βασίζονται αρχικά σε δεδομένα που καταγράφονται σε χρονικό στάδιο 1 λεπτού. Οι κανόνες ομαδοποίησης έχουν ως εξής: "_min" Ελάχιστες ωριαίες τιμές μεταξύ 1h UTC +1 και 0h UTC +1. "_avg" Μέση ωριαία τιμή μεταξύ 1h UTC +1 και 0h UTC +1. "_max" Μέγιστες ωριαίες τιμές μεταξύ 1h UTC +1 και 0h UTC +1. "_sum" Άθροισμα ωριαίων τιμών από 1h UTC +1 έως 0h UTC +1. @el
description: De beschikbaar gestelde gegevens zijn die van het 'Pameseb'-netwerk van CRA-W. De beschikbare maatregelen hebben betrekking op: luchttemperatuur in °C (tsa), neerslag in mm (plu) , relatieve vochtigheid in % (hra), zonneschijn in J/cm ² (nls), bevochtiging van het gebladerte in nb min/uur (hct); windsnelheid op 2 meter in m/s (vvt) De verstrekte gegevens zijn van dagelijkse frequentie. Uurgegevens zijn beschikbaar op Agromet.be. Dagelijkse gegevens (minimaal, gemiddeld, maximaal of cumulatief) zijn in eerste instantie gebaseerd op gegevens die zijn geregistreerd in een tijdstap van 1 minuut. De aggregatieregels zijn als volgt: "_min" Minimale uurwaarden tussen 1u UTC +1 en 0u UTC +1. "_avg" Gemiddelde uurwaarden tussen 1u UTC +1 en 0u UTC +1. "_max" Maximale uurwaarden tussen 1u UTC +1 en 0u UTC +1. "_sum" Som van uurwaarden van 1u UTC +1 tot 0u UTC +1.
contact point: Kind
  fn: Agromet
access rights: openbaar
description: Pieejamie dati ir CRA-W tīkla "Pameseb" dati. Pieejamie pasākumi attiecas uz: gaisa temperatūra °C (tsa), nokrišņi milimetros (plu) , relatīvais mitrums % (hra), saules gaisma J/cm ² (ens), lapotnes mitrināšanu nb min/stundā (hct), vēja ātrums pie 2 metriem m/s (vvt) Sniegtie dati ir pieejami katru dienu. Stundas dati ir pieejami Agromet.be. Dienas dati (minimālais, vidējais, maksimālais vai kumulatīvais) sākotnēji ir balstīti uz datiem, kas reģistrēti 1 minūtes laika posmā. Apkopošanas noteikumi ir šādi: "_min" Minimālās stundas vērtības starp 1 h UTC +1 un 0 h UTC +1. "_avg" vidējās stundas vērtības starp 1h UTC +1 un 0h UTC +1. "_max" maksimālās stundas vērtības starp 1 h UTC +1 un 0 h UTC +1. "_sum" Stundas vērtību summa no 1 h UTC +1 līdz 0 h UTC +1. @lv
description: Is iad na sonraí a chuirtear ar fáil sonraí líonra 'Pameseb' CRA-W. Baineann na bearta atá ar fáil leis an méid seo a leanas: teocht an aeir in °C (tsa), * Frasaíocht i mm (plu) , bogthaise choibhneasta in % (hra), * Sunshine i J / cm ² (ens), humectation an duilliúr in nb min/uair an chloig (hct), luas na gaoithe ag 2 mhéadar i m/s (vvt) Tá na sonraí a chuirtear ar fáil ar mhinicíocht laethúil. Tá sonraí in aghaidh na huaire ar fáil ar Agromet.be. Tá sonraí laethúla (íosmhéid, meán, uasmhéid nó carnadh) bunaithe ar dtús ar shonraí a thaifeadtar ag céim ama 1 nóiméad. Is iad seo a leanas na rialacha maidir le comhiomlánú: "_min" Luachanna íosta in aghaidh na huaire idir 1h AUL +1 agus 0h AUL +1. "_avg" Meánluachanna in aghaidh na huaire idir 1h AUL +1 agus 0h AUL +1. "_max" Uasluachanna in aghaidh na huaire idir 1h AUL +1 agus 0h AUL +1. "_sum" Suim na luachanna in aghaidh na huaire ó 1h AUL +1 go 0h AUL +1. @ga
description: Los datos facilitados son los de la red «Pameseb» de CRA-W. Las medidas disponibles se refieren a: temperatura del aire en °C (tsa), , precipitación en mm (plu) humedad relativa en % (hra), a la luz del sol en J/cm ² (ens), humectación del follaje en nb min/hora (hct), Velocidad del viento a 2 metros en m/s (vvt) Los datos proporcionados son de frecuencia diaria. Los datos horarios están disponibles en Agromet.be. Los datos diarios (mínimo, promedio, máximo o acumulación) se basan inicialmente en datos registrados en un paso de tiempo de 1 minuto. Las reglas de agregación son las siguientes: "_min" Valores horarios mínimos entre 1h UTC +1 y 0h UTC +1. "_avg" Valores horarios medios entre 1h UTC +1 y 0h UTC +1. "_max" Valores horarios máximos entre 1h UTC +1 y 0h UTC +1. "_sum" Suma de valores horarios de 1h UTC +1 a 0h UTC +1. @es
description: Dostupni su podaci mreže CRA-W „Pameseb”. Dostupne mjere odnose se na: temperatura zraka u °C (tsa), oborine u mm (plu) , relativna vlažnost u % (hra), sunce u J/cm ² (ens), ovlaživanje lišća u nb min/sat (hct), brzina vjetra na 2 metra u m/s (vvt) Dostavljeni podaci su dnevne frekvencije. Podatci o satu dostupni su na Agromet.be. Dnevni podaci (minimalni, prosječni, maksimalni ili kumulativni) u početku se temelje na podacima zabilježenima u vremenskom koraku od jedne minute. Pravila agregiranja su sljedeća: "_min" Minimalne satne vrijednosti između 1h UTC +1 i 0h UTC +1. "_avg" Prosječne satne vrijednosti između 1h UTC +1 i 0h UTC +1. "_max" Najveće satne vrijednosti između 1h UTC +1 i 0h UTC +1. "_sum" Zbroj satnih vrijednosti od 1h UTC +1 do 0h UTC +1. @hr
description: Надані дані належать до мережі "Pameseb" CRA-W. Доступні заходи стосуються: температура повітря в °С (тса), * Опади в мм (plu) , відносна вологість повітря в % (гр), ======================================= зволоження листя в нб хв/год (hct), швидкість вітру 2 метри в м/с (vvt) Надані дані мають добову частоту. Погодинна інформація доступна на сайті Agromet.be. Щоденні дані (мінімальна, середня, максимальна або кумуляція) спочатку базуються на даних, записаних на 1-хвилинному етапі часу. Правила агрегації такі: "_min" Мінімальні погодинні значення між 1h UTC +1 і 0h UTC +1. "_avg" Середні погодинні значення між 1h UTC +1 і 0h UTC +1. "_max" Максимальні погодинні значення між 1h UTC +1 і 0h UTC +1. "_sum" Сума погодинних значень від 1h UTC +1 до 0h UTC +1. @uk
title: ТОВ « Агромет » @uk
description: Les données mises à dispositions sont celles du réseau 'Pameseb' du CRA-W. Les mesures disponibles concernent: la température de l’air en °C (tsa), les précipitations en mm (plu) , l'humidité relative en % (hra), l'ensoleillement en J/cm² (ens), l'humectation du feuillage en nb min/heure (hct), la vitesse du vent à 2 mètres en m/s (vvt) Les données fournies sont de fréquence journalière. Les données horaires sont disponibles sur Agromet.be. Les données journalières (minimum, moyenne, maximum ou cumul) sont initialement basées sur des données enregistrées au pas de temps 1-minute. Les règles d’agrégation sont les suivantes : « _min » Minimum des valeurs horaires entre 1h UTC +1 à 0h UTC +1. « _avg » Moyenne des valeurs horaires entre 1h UTC +1 à 0h UTC +1. « _max » Maximum des valeurs horaires entre 1h UTC +1 à 0h UTC +1. « _sum » Somme des valeurs horaires de 1h UTC +1 à 0h UTC +1.. @fr
landing page: https://www.odwb.be/explore/dataset/agromet/information/
description: Zpřístupněnými údaji jsou údaje sítě CRA-W „Pameseb“. Dostupná opatření se týkají: teplota vzduchu v °C (tsa), srážky v mm (plu) , relativní vlhkost v % (hra), sluneční svit v J/cm ² (ens), zvlhčení listů v nb min/hod (hct), rychlost větru 2 metry v m/s (vvt) Poskytované údaje mají denní frekvenci. Hodinové údaje jsou k dispozici na Agromet.be. Denní údaje (minimální, průměrné, maximální nebo kumulace) jsou zpočátku založeny na údajích zaznamenaných v jednominutovém časovém kroku. Pravidla agregace jsou následující: "_min" Minimální hodinové hodnoty mezi 1h UTC +1 a 0h UTC +1. "_avg" Průměrné hodinové hodnoty mezi 1h UTC +1 a 0h UTC +1. "_max" Maximální hodinové hodnoty mezi 1h UTC +1 a 0h UTC +1. "_sum" Součet hodinových hodnot od 1h UTC +1 do 0h UTC +1. @cs
issued: 2024-05-23T00:00:00
description: Kättesaadavaks on tehtud CRA-W Pamesebi võrgustiku andmed. Kättesaadavad meetmed hõlmavad järgmist: õhutemperatuur °C (tsa), sademed millimeetrites (plu) , suhteline õhuniiskus protsentides (hra), päikesepaiste J/cm ² (ens), lehestiku niisutamine nb min/h (hct), tuule kiirus 2 m/s (vvt) Esitatud andmed on igapäevased. Tunniandmed on kättesaadavad veebisaidil Agromet.be. Igapäevased andmed (miinimum-, keskmine-, maksimum- või kumulatsioonandmed) põhinevad esialgu 1-minutilisel ajasammul salvestatud andmetel. Koondamiseeskirjad on järgmised: "_min" minimaalsed tunniväärtused vahemikus 1h UTC +1 kuni 0h UTC +1. "_avg" Keskmised tunniväärtused vahemikus 1h UTC +1 kuni 0h UTC +1. "_max" Tunni maksimumväärtused vahemikus 1h UTC +1 kuni 0h UTC +1. "_sum" Tunniväärtuste summa vahemikus 1h UTC +1 kuni 0h UTC +1. @et
description: Podatki, ki so na voljo, so podatki mreže "Pameseb" CRA-W. Razpoložljivi ukrepi se nanašajo na: temperatura zraka v °C (tsa), padavine v mm (plu) , relativna vlažnost v % (hra), osončenost v J/cm ² (ens), vlaženje listja v nb min/uro (hct), hitrost vetra pri 2 metrih v m/s (vvvt) Posredovani podatki so dnevni. Urni podatki so na voljo na Agromet.be. Dnevni podatki (minimalni, povprečni, maksimalni ali kumulacijski) na začetku temeljijo na podatkih, zabeleženih v 1-minutnem časovnem koraku. Pravila združevanja so naslednja: "_min" Najmanjše urne vrednosti med 1h UTC +1 in 0h UTC +1. "_avg" Povprečne urne vrednosti med 1h UTC +1 in 0h UTC +1. "_max" Največje urne vrednosti med 1h UTC +1 in 0h UTC +1. "_sum" Vsota urnih vrednosti od 1h UTC +1 do 0h UTC +1. @sl
publisher: SPW CRA-W Centre wallon de Recherches agronomiques
description: I dati messi a disposizione sono quelli della rete «Pameseb» di CRA-W. Le misure disponibili riguardano: temperatura dell'aria in °C (tsa), precipitazione in mm (plu) , umidità relativa in % (hra), sole in J/cm ² (ens), umettazione del fogliame in nb min/ora (hct), velocità del vento a 2 metri in m/s (vvt) I dati forniti sono di frequenza giornaliera. I dati orari sono disponibili su Agromet.be. I dati giornalieri (minimo, medio, massimo o cumulativo) si basano inizialmente su dati registrati in un minuto. Le regole di aggregazione sono le seguenti: "_min" Valori orari minimi tra 1h UTC +1 e 0h UTC +1. "_avg" Valori orari medi tra 1h UTC +1 e 0h UTC +1. "_max" Valori orari massimi compresi tra 1 ora UTC +1 e 0 ore UTC +1. "_sum" Somma dei valori orari da 1h UTC +1 a 0h UTC +1. @it
keyword: normal @fr
spatial: Wallonia
description: Datele puse la dispoziție sunt cele ale rețelei „Pameseb” a CRA-W. Măsurile disponibile se referă la: temperatura aerului în °C (tsa); precipitații în mm (plus) , umiditatea relativă în % (hra), soare în J/cm ² (ens), umectarea frunzișului în nb min/oră (hct); viteza vântului la 2 metri în m/s (vvt) Datele furnizate sunt de frecvență zilnică. Datele orare sunt disponibile pe Agromet.be. Datele zilnice (minime, medii, maxime sau cumulate) se bazează inițial pe datele înregistrate într-un interval de 1 minut. Regulile de agregare sunt următoarele: "_min" Valori orare minime între 1h UTC +1 și 0h UTC +1. "_avg" Valori orare medii cuprinse între 1h UTC +1 și 0h UTC +1. "_max" Valori orare maxime între 1h UTC +1 și 0h UTC +1. "_sum" Suma valorilor orare de la 1h UTC +1 la 0h UTC +1. @ro
description: De uppgifter som görs tillgängliga är de från CRA-W:s "Pameseb"-nätverk. De tillgängliga åtgärderna gäller följande: Lufttemperatur i °C (tsa). nederbörd i mm (plu) , relativ fuktighet i % (hra), solsken i J/cm ² (ens), Befuktning av bladverket i nb min/timme (hct). vindhastighet vid 2 meter i m/s (vvt) De uppgifter som lämnas är av daglig frekvens. Timdata finns tillgängliga på Agromet.se. Dagliga data (minimum, medelvärde, maximum eller kumulation) baseras initialt på data som registreras vid 1 minuts tidssteg. Aggregeringsreglerna är följande: "_min" Minsta timvärden mellan 1h UTC +1 och 0h UTC +1. "_avg" Genomsnittliga timvärden mellan 1h UTC +1 och 0h UTC +1. "_max" Maximala timvärden mellan 1h UTC +1 och 0h UTC +1. "_sum" Summan av timvärden från 1h UTC +1 till 0h UTC +1. @sv
creator: CRA-W%2FAgromet.be
description: Udostępnione dane pochodzą z sieci agencji ratingowych CRA-W „Pameseb”. Dostępne środki dotyczą: temperatura powietrza w °C (tsa), Opady w mm (plu) , wilgotność względna w % (hra), słoneczko w J/cm ² (ens), humektacja liści w nb min/godzinę (hct), prędkość wiatru 2 metry w m/s (vvt) Podane dane są podawane z częstotliwością dzienną. Dane godzinowe są dostępne na stronie Agromet.be. Dane dzienne (minimalna, średnia, maksymalna lub kumulacja) są początkowo oparte na danych zarejestrowanych w ciągu 1 minuty. Zasady agregacji są następujące: "_min" Minimalne wartości godzinowe między 1h UTC +1 a 0h UTC +1. "_avg" Średnie wartości godzinowe między 1h UTC +1 i 0h UTC +1. "_max" Maksymalne wartości godzinowe między 1h UTC +1 a 0h UTC +1. "_sum" Suma wartości godzinowych od 1h UTC +1 do 0h UTC +1. @pl
subject: https://www.odwb.be/explore/
keyword: climatique @fr
title: Agraimeit @ga
description: Sprístupnené údaje sú údaje siete „Pameseb“ CRA-W. Dostupné opatrenia sa týkajú: teplota vzduchu v °C (tsa), Zrážky v mm (plu) , relatívna vlhkosť v % (hra), slnečný svit v J/cm ² (ens), zvlhčovanie lístia v nb min/hodinu (hct), rýchlosť vetra 2 metre v m/s (vvt) Poskytnuté údaje majú dennú frekvenciu. Hodinové údaje sú k dispozícii na Agromet.be. Denné údaje (minimálne, priemerné, maximálne alebo kumulácia) sú spočiatku založené na údajoch zaznamenaných v 1-minútovom časovom kroku. Pravidlá agregácie sú tieto: "_min" Minimálne hodinové hodnoty medzi 1 h UTC +1 a 0 h UTC +1. "_avg" Priemerné hodinové hodnoty medzi 1h UTC +1 a 0h UTC +1. "_max" Maximálne hodinové hodnoty medzi 1 h UTC +1 a 0 h UTC +1. "_sum" Súčet hodinových hodnôt od 1h UTC +1 do 0h UTC +1. @sk
modified: 2026-07-09T10:02:13.685Z
language: Frans
keyword: environnement @fr
description: Saatavilla olevat tiedot ovat CRA-W:n Pameseb-verkoston tietoja. Käytettävissä olevat toimenpiteet koskevat seuraavia: ilman lämpötila °C (tsa), sademäärä millimetreinä (plu) , suhteellinen kosteus prosentteina (hra), auringonpaistetta J/cm ² (ens), lehtien humektointi nb min/tunti (hct), tuulen nopeus 2 m/s (vvt) Annetut tiedot ovat päivittäisiä. Tuntitiedot ovat saatavilla osoitteessa Agromet.be. Päivittäiset tiedot (vähimmäis-, keskiarvo-, enimmäis- tai kumulaatiotiedot) perustuvat aluksi 1 minuutin aikavaiheeseen kirjattuihin tietoihin. Yhteenlaskemista koskevat säännöt ovat seuraavat: "_min" Vähimmäistuntiarvot välillä 1h UTC +1 ja 0h UTC +1. "_avg" Keskimääräiset tuntiarvot välillä 1h UTC +1 ja 0h UTC +1. "_max" Enimmäistuntiarvot välillä 1h UTC +1 ja 0h UTC +1. "_sum" Tuntiarvojen summa välillä 1h UTC +1 - 0h UTC +1. @fi
description: A rendelkezésre bocsátott adatok a CRA-W "Pameseb" hálózatának adatai. A rendelkezésre álló intézkedések a következőkre vonatkoznak: a levegő hőmérséklete °C-ban (tsa), csapadék mm-ben (plu) , relatív páratartalom %-ban (hra), a napsütés J/cm ² (ens) mértékegységben, a lombozat nedvesítése nb min/órában (hct), szélsebesség 2 m/s-ban (vvt) A megadott adatok napi gyakoriságúak. Az óránkénti adatok az Agromet.be oldalon érhetők el. A napi adatok (minimum, átlag, maximum vagy kumuláció) kezdetben az 1 perces időlépésben rögzített adatokon alapulnak. Az összesítési szabályok a következők: "_min" Minimális óránkénti értékek 1h UTC +1 és 0h UTC +1 között. "_avg" Átlagos óránkénti értékek 1h UTC +1 és 0h UTC +1 között. "_max" Maximális óránkénti értékek 1h UTC +1 és 0h UTC +1 között. "_sum" Az óránkénti értékek összege az 1h UTC +1 és 0h UTC +1 között. @hu

SPW CRA-W Centre wallon de Recherches agronomiques
type: Organization
type: Regionaal bestuur
type: Agent

Regionaal bestuur
type: Concept
preferred label: Regional Authority @en
in scheme: http://purl.org/adms/publishertype/1.0

agromet.xlsx
type: Distribution
issued: 2024-05-23T00:00:00
description: Αγρομέτη (xlsx) @el
description: Agromet (xlsx) @mt
format: XLSX
description: Агромет (xlsx) @uk
availability: AVAILABLE
title: agraimhiotal.xlsx @ga
media type: application/vnd.openxmlformats-officedocument.spreadsheetml.sheet
description: Agromet (xlsx) - Kto odpowiedział? @pl
modified: 2026-07-09T10:02:13.685Z
download URL: https://www.odwb.be/api/explore/v2.1/catalog/datasets/agromet/exports/xlsx#
language: Frans
access URL: https://www.odwb.be/explore/dataset/agromet/information/
description: Agraimeit (xlsx) @ga
license: CC-BY-NC

XLSX
type: MediaTypeOrExtent
preferred label: Excel XLSX
type: Concept
in scheme: file-type

application/vnd.openxmlformats-officedocument.spreadsheetml.sheet
type: Concept
preferred label: XLSX
type: MediaType

Frans
type: Concept
preferred label: French @en
preferred label: Français @fr
type: LinguisticSystem
in scheme: language
preferred label: français @fr
preferred label: Französisch @de

CC-BY-NC
type: LicenseDocument
type: Non-Commercial Use Only
type: Naamsvermelding

Non-Commercial Use Only
type: Concept
in scheme: http://purl.org/adms/licencetype/1.0

Naamsvermelding
type: Concept
preferred label: Attribution
in scheme: http://purl.org/adms/licencetype/1.0
notation: Attribution
type: LicenseDocument
preferred label: Verplichte bronvermelding

agromet.ov2
type: Distribution
description: Agromet (ov2)
modified: 2026-07-09T10:02:13.685Z
license: CC-BY-NC
description: Põld-võõrkapsas (ov2) @et
format: TXT
download URL: https://www.odwb.be/api/explore/v2.1/catalog/datasets/agromet/exports/ov2#
description: Agraimeit (ov2) @ga
description: Агромет (ov2) @bg
availability: AVAILABLE
language: Frans
issued: 2024-05-23T00:00:00
access URL: https://www.odwb.be/explore/dataset/agromet/information/
media type: plain

TXT
type: MediaTypeOrExtent
in scheme: file-type
type: Concept

Agriculture
type: Concept
preferred label: AGRICULTURE, FISHERIES, FORESTRY, FOOD @en
in scheme: data-theme
preferred label: Agriculture, pêche, sylviculture et alimentation @fr

agromet.ttl
type: Distribution
description: Agromet (turtle) @fr
description: Agromet (tartaruga) @pt
description: Agromet (vėžlys) @lt
description: Agromet (țestoasă) @ro
description: Agromet (skildpadde) @da
license: CC-BY-NC
download URL: https://www.odwb.be/api/explore/v2.1/catalog/datasets/agromet/exports/turtle#
media type: text/turtle
description: Agromet (schildpad)
description: Agromet (żółw) @pl
description: Agromet (bruņurupucis) @lv
description: Agromet (kornjača) @hr
description: Агромет (черепаха) @uk
description: Agromet (kilpkonn) @et
description: Agromet (želva) @sl
description: Agromet (tortuga) @es
access URL: https://www.odwb.be/explore/dataset/agromet/information/
description: Agromet (kilpikonna) @fi
issued: 2024-05-23T00:00:00
description: Agromet (χελώνα) @el
modified: 2026-07-09T10:02:13.685Z
language: Frans
description: Агромет (костенурка) @bg
description: Agromet (teknős) @hu
availability: AVAILABLE
description: Agromet (korytnačka) @sk
description: Agromet (fekruna) @mt
description: Agromet (sköldpadda) @sv
description: Agraimeit (turtar) @ga
format: TTL

text/turtle
type: Concept
in scheme: media-types
type: MediaType

TTL
type: MediaTypeOrExtent
type: Concept
in scheme: file-type
preferred label: RDF Turtle

agromet.jsonl
type: Distribution
media type: application/json
description: Агромет (jsonl) @uk
description: Agromet (rozcestník) @cs
description: Agromet (jsonl) @da
license: CC-BY-NC
description: Agromet (täsmennyssivu) @fi
download URL: https://www.odwb.be/api/explore/v2.1/catalog/datasets/agromet/exports/jsonl#
issued: 2024-05-23T00:00:00
description: Agromet (egyértelműsítő lap) @hu
availability: AVAILABLE
format: JSON
description: Agromet (desambiguación) @es
description: Αγρομέτη (jsonl) @el
description: Агромет @bg
description: Agromet (ujednoznacznienie) @pl
description: Agromet (jsonl) Sistēmas Prasības @lv
modified: 2026-07-09T10:02:13.685Z
language: Frans
access URL: https://www.odwb.be/explore/dataset/agromet/information/
description: Agromet (desambiguação) @pt

application/json
type: Concept
in scheme: media-types
type: MediaType

JSON
type: MediaTypeOrExtent
type: Concept
in scheme: file-type

dagelijks
type: Frequency
in scheme: frequency
preferred label: täglich @de
preferred label: quotidien @fr
preferred label: daily @en
type: Concept

agromet.gpx
type: Distribution
description: Agromet (gpx) @sv
download URL: https://www.odwb.be/api/explore/v2.1/catalog/datasets/agromet/exports/gpx#
description: Агромет (gpx) @bg
format: XML
media type: text/xml
issued: 2024-05-23T00:00:00
title: agraimhiotal.gpx @ga
description: Agraimeit (gpx) @ga
license: CC-BY-NC
description: Αγρομέτη (gpx) @el
modified: 2026-07-09T10:02:13.685Z
access URL: https://www.odwb.be/explore/dataset/agromet/information/
availability: AVAILABLE
language: Frans

XML
type: MediaTypeOrExtent
in scheme: file-type
type: Concept

text/xml
type: Concept
type: MediaType

agromet.n3
type: Distribution
description: Агромет (n3) @bg
license: CC-BY-NC
description: Agromet (n3)
availability: AVAILABLE
title: agraimhiotal.n3 @ga
language: Frans
format: N3
access URL: https://www.odwb.be/explore/dataset/agromet/information/
media type: https://www.iana.org/assignments/media-types/text/n3
description: Αγρομέτη (n3) @el
description: Agraimhiotal (n3) @ga
modified: 2026-07-09T10:02:13.685Z
issued: 2024-05-23T00:00:00
download URL: https://www.odwb.be/api/explore/v2.1/catalog/datasets/agromet/exports/n3#
title: агромет.n3 @bg

N3
type: Concept
in scheme: file-type
type: MediaTypeOrExtent

agromet.parket
type: Distribution
title: agromet.parkett @sv
modified: 2026-07-09T10:02:13.685Z
title: agromet.parquet @en
description: Agraimeit (paráid) @ga
description: Agromet (parquet) @fi
issued: 2024-05-23T00:00:00
description: Agromet (parket)
title: agromet.parkquet @lv
license: CC-BY-NC
access URL: https://www.odwb.be/explore/dataset/agromet/information/
description: Agromet (parkety) @cs
description: Agromet (parketas) @lt
availability: AVAILABLE
language: Frans
description: Agromet (parchet) @ro
title: agromet.parketta @hu
format: Parquet
description: Agromet (parkett) @sv
description: Agromet (Staatsanwaltschaft) @de
description: Агромет (паркет) @bg
description: Agromet (parkets) @lv
media type: parquet
title: agromet.parkety @cs
description: Agromet (parkiet) @pl
download URL: https://www.odwb.be/api/explore/v2.1/catalog/datasets/agromet/exports/parquet#
description: Agromet (parquete) @pt
description: Agromet (παρκέ) @el
description: Agromet (parketta) @hu

Parquet
type: Concept
in scheme: file-type
type: MediaTypeOrExtent

openbaar
type: Concept
preferred label: public @fr
preferred label: without conditions @fr
in scheme: access-right
preferred label: Toegang zonder voorwaarden
type: RightsStatement
preferred label: öffentlich @de
preferred label: publiek
preferred label: publicly available @en
preferred label: Public @en

agromet.zip
type: Distribution
description: Αγρομέτη (shp) @el
issued: 2024-05-23T00:00:00
description: Agromet (šp) @lt
description: Agromet (shp) @ro
media type: vnd.shp
description: Агромет @bg
license: CC-BY-NC
description: Агромет (шп) @uk
availability: AVAILABLE
description: Agromet (shp) Sistēmas Prasības @lv
modified: 2026-07-09T10:02:13.685Z
description: Agromet (täsmennyssivu) @fi
access URL: https://www.odwb.be/explore/dataset/agromet/information/
compress format: ZIP
description: Agromet (styck) @sv
description: Agromet (livro) @pt
description: Agromet (miasto) @pl
format: SHP
download URL: https://www.odwb.be/api/explore/v2.1/catalog/datasets/agromet/exports/shp#
description: Agromet (polpaccio) @it
description: Agromet (hudební skupina) @cs
language: Frans
description: Agromet (serie de televisión) @es
description: Agraiméad (shp) @ga

ZIP
type: Concept
type: MediaType
preferred label: application/zip

SHP
type: MediaTypeOrExtent
type: Concept
preferred label: Esri Shape
in scheme: file-type

agromet.csv
type: Distribution
description: Agromet (csv) @ro
description: Agromet (ČSV) @cs
availability: AVAILABLE
issued: 2024-05-23T00:00:00
format: CSV
download URL: https://www.odwb.be/api/explore/v2.1/catalog/datasets/agromet/exports/csv#
description: Агромет @bg
description: Agraimeit (csv) @ga
access URL: https://www.odwb.be/explore/dataset/agromet/information/
description: Агромет (csv) @uk
media type: text/csv
license: CC-BY-NC
description: Agromet (täsmennyssivu) @fi
language: Frans
modified: 2026-07-09T10:02:13.685Z
description: Αγρομέτη (csv) @el

CSV
type: MediaTypeOrExtent
type: Concept
in scheme: file-type

text/csv
type: MediaType
in scheme: media-types
type: Concept

agromet.fgb
type: Distribution
description: Агромет (fgb) @uk
description: Agromet (fgb) @da
download URL: https://www.odwb.be/api/explore/v2.1/catalog/datasets/agromet/exports/fgb#
media type: octet-stream
license: CC-BY-NC
availability: AVAILABLE
title: agraimhiotal.fgb @ga
modified: 2026-07-09T10:02:13.685Z
description: Agraimeit (fgb) @ga
access URL: https://www.odwb.be/explore/dataset/agromet/information/
issued: 2024-05-23T00:00:00
language: Frans
description: Αγρομέτη (fgb) @el
format: BIN

BIN
type: MediaTypeOrExtent
type: Concept
in scheme: file-type

Wallonia
type: Location
bbox: POLYGON((2.54 50.85,6.41 50.85,6.41 49.49,2.54 49.49,2.54 50.85)))

CRA-W%2FAgromet.be
type: Organization
type: Agent

agromet.kml
type: Distribution
description: Agromet (kml)
download URL: https://www.odwb.be/api/explore/v2.1/catalog/datasets/agromet/exports/kml#
description: Агромет (kml) @bg
title: agraimhiotal.kml @ga
license: CC-BY-NC
format: KML
media type: vnd.google-earth.kml+xml
access URL: https://www.odwb.be/explore/dataset/agromet/information/
description: Αγρομετ (kml) @el
modified: 2026-07-09T10:02:13.685Z
language: Frans
issued: 2024-05-23T00:00:00
availability: AVAILABLE
title: Αγρομετ.kml @el
description: Агромет (кмл) @uk

KML
type: MediaTypeOrExtent
type: Concept
in scheme: file-type

agromet.rdf
type: Distribution
description: Agromet (rdfxml)
media type: rdf+xml
description: Агромет (rdfxml) @uk
availability: AVAILABLE
title: agraimhiotal.rdf @ga
format: RDF/XML
modified: 2026-07-09T10:02:13.685Z
license: CC-BY-NC
description: Αγρομέτη (rdfxml) @el
issued: 2024-05-23T00:00:00
language: Frans
description: Agraimeit (rdfxml) @ga
download URL: https://www.odwb.be/api/explore/v2.1/catalog/datasets/agromet/exports/rdfxml#
access URL: https://www.odwb.be/explore/dataset/agromet/information/

RDF/XML
type: MediaTypeOrExtent
in scheme: file-type
type: Concept

agromet.json
type: Distribution
description: Agromet (json)
description: Agromet (json) Sistēmas Prasības @lv
description: Agromet (poliziotto) @it
description: Agromet (sin) @hr
description: Агромет @bg
license: CC-BY-NC
description: Агромет (json) @uk
description: Agromet (syn) @cs
description: Põld-võõrkapsas (json) @et
description: Agromet (ujednoznacznienie) @pl
description: Agromet (täsmennyssivu) @fi
modified: 2026-07-09T10:02:13.685Z
description: Αγρομέτ (ισονικά) @el
availability: AVAILABLE
issued: 2024-05-23T00:00:00
format: JSON
download URL: https://www.odwb.be/api/explore/v2.1/catalog/datasets/agromet/exports/json#
media type: application/json
description: Agromet (Džonas) @lt
description: Agromet (egyértelműsítő lap) @hu
language: Frans
description: Agromet (olika betydelser) @sv
description: Agromet (desambiguación) @es
description: Agromet (jogo eletrônico) @pt
access URL: https://www.odwb.be/explore/dataset/agromet/information/

agromet.jsonld
type: Distribution
description: Agromet (rozcestník) @cs
availability: AVAILABLE
modified: 2026-07-09T10:02:13.685Z
description: Agromet (jsonld) @it
media type: ld+json
description: Agromet (jsonld) Sistēmas Prasības @lv
description: Агромет @bg
license: CC-BY-NC
description: Agromet (viittaukset muokkaa) @fi
download URL: https://www.odwb.be/api/explore/v2.1/catalog/datasets/agromet/exports/jsonld#
description: Agromet (ujednoznacznienie) @pl
description: Агромет (jsonld) @uk
language: Frans
description: Agromet (desambiguación) @es
access URL: https://www.odwb.be/explore/dataset/agromet/information/
description: Αγρομέτ (ισονδ) @el
format: JSON-LD
issued: 2024-05-23T00:00:00
description: Agromet (olika betydelser) @sv
description: Agromet (egyértelműsítő lap) @hu
description: Agromet (desambiguação) @pt

JSON-LD
type: MediaTypeOrExtent
type: Concept
in scheme: file-type

agromet.geojson
type: Distribution
description: Agromet (geojson) @sl
description: Агромет (геойсон) @uk
media type: application/json
description: Agromet (olika betydelser) @sv
modified: 2026-07-09T10:02:13.685Z
availability: AVAILABLE
license: CC-BY-NC
description: Agromet (γεωγραφία) @el
description: Agromet (jogo eletrônico) @pt
issued: 2024-05-23T00:00:00
description: Agromet (egyértelműsítő lap) @hu
language: Frans
description: Agromet (miasto) @pl
description: Agromet (desambiguación) @es
download URL: https://www.odwb.be/api/explore/v2.1/catalog/datasets/agromet/exports/geojson#
format: JSON
access URL: https://www.odwb.be/explore/dataset/agromet/information/